{"text_format":"1","workbook":"xlsx","n_sheets":15,"sheets":["Introduction & Revisions","Input","Input Diagrams","Output","SW1","SW2","SW3","SW4","P1","P2","P3","P4","SUMMARY","Member Local Coordinates","Pick Lists & Data"],"not_rendered":{"charts":0,"images":3,"macros":1,"external_links":0,"defined_names":59,"comments":0,"pivot_tables":0},"unopened":[],"bounds":{"document_bytes":16777216,"sheet_cells":100000,"rows_first":2000,"rows_last":500,"rows_between":2000,"halvings":0,"cell_chars":16384,"cell_head_chars":4096},"cells_cut":0,"cells_raw":0,"read":"whole","date_system":"1900"}

{"sheet":"Introduction & Revisions","index":0,"n_rows":227,"n_cols":8,"rows_kept":227,"cut":false,"hidden":false,"merged":[[0,0,0,6],[28,3,28,6],[21,3,21,6],[22,3,22,6],[23,3,23,6],[24,3,24,6],[25,3,25,6],[26,3,26,6],[27,3,27,6],[11,1,11,6],[3,1,3,6],[7,1,7,6],[12,1,12,6],[19,1,19,6],[6,1,6,6],[16,1,16,6],[17,1,17,6],[18,1,18,6],[20,1,20,6],[33,3,33,6],[29,3,29,6],[30,3,30,6],[31,3,31,6],[32,3,32,6]]}
["Span Wire Analysis"]
[]
["Introduction:"]
[null,"The purpose of this worksheet/workbook is to evaluate the various design arrangements of traffic components installed on each span wire between strain poles in order to develop the minimum required tension a strain pole must resist at any given corner of an intersection.\n                                                                                                                                                                                                                                                                                                                                             The procedure will follow the Pennsylvania Department of -Transportation \"Criteria for the Design of Traffic Related Structures\". {Per Publication 408, Section 1104.02 (a) }"]
[]
["Assumptions:"]
["  1.)","Design is in accordance with PennDOT Publications 148 and 149 and AASHTO Standard Specifications for Structural Supports for Highway Signs, Luminaries and Traffic Signals, 4th Edition with 2002 and 2003 Interims"]
["2.)","Signal Configuration & Signal Sections in Each Direction are as described in PennDOT Publication 149, Table 20-4"]
["3.)","Assume all overhead signals have 12\" lenses with backplate, 5 inch border"]
["4.)","Signal weights are in accordance with PennDOT Publication 149, Table 20-2"]
["5.)","Loading identification as shown on TC-8801, Sheet 2 of 7"]
["6.)","For calculating reactions on strain poles due to the span wires, the wind is assumed to act at 0˚, 45˚ and 90˚.   When wind acts parallel to a span wire a force of 0.2 times the wind force on that span wire is assumed to act in the direction of the wind.  The effect of the wind acting at different angles is conservatively neglected in calculating the Fx value for each span wire."]
["7.)","For calculating reactions on strain poles due wind acting at different angles, the program assumes that the angles between cables in a box arrangement are 90 degrees. Intersections in which the cable angles at the corners are within 15 degrees, plus or minus, of 90 degrees (angles of 75 to 105 degrees) should produce acceptable results."]
["8.)","Effects due to strain pole deflection are not considered when calculating span wire tension."]
[]
{"$rows_left_out":213}
{"sheet":"Input","index":1,"n_rows":99,"n_cols":21,"rows_kept":99,"cut":false,"hidden":false,"merged":[[57,3,57,5],[69,1,70,1],[69,2,70,2],[58,4,59,4],[58,5,59,5],[58,2,59,2],[58,1,59,1],[2,1,2,5],[44,4,44,5],[8,0,8,9],[3,1,3,5],[13,0,13,9],[14,0,14,9],[141,18,142,18],[141,19,142,19],[141,20,142,20],[19,18,20,18],[19,19,20,19],[19,15,20,15],[19,16,20,16],[19,17,20,17],[58,6,59,6],[58,8,59,8],[57,6,57,8],[141,17,142,17],[141,16,142,16],[98,6,98,9],[74,6,75,6],[96,8,96,9],[89,0,89,9],[85,1,86,1],[74,5,75,5],[74,4,75,4],[74,1,75,1],[74,8,75,8],[58,3,59,3],[73,3,73,5],[74,7,75,7],[85,2,86,2],[74,2,75,2],[74,3,75,3],[58,7,59,7],[73,6,73,8]]}
["Span Wire Analysis - Input"]
[]
["Project:","Sample Input/Output"]
["Intersection:","SR XX & SR XX"]
["Input By:","MEC","Date:","2011-07-20"]
["Checked By:","XXX","Date:","XXX"]
[]
["Spreadsheet Assumptions and References:"]
["- Design is in accordance with PennDOT Publications 148 and 149 and AASHTO Standard Specifications for Structural \n  Supports for Highway Signs, Luminaries and Traffic Signals, 4th Edition with 2002 and 2003 Interims"]
["- Signal Configuration & Signal Sections in Each Direction are as described in PennDOT Publication 149, Table 20-4"]
["- Assume all overhead signals have 12\" lenses with backplate, 5 inch border"]
["- Signal weights are in accordance with PennDOT Publication 149, Table 20-2"]
["- Loading identification as shown on TC-8801, Sheet 2 of 7"]
["- For calculating reactions on strain poles due to the span wires, the wind is assumed to act at 0˚, 45˚ and 90˚.   When wind acts parallel to a span wire a force of 0.2 times the wind force on that span wire is assumed to act in the direction of the wind.  The effect of the wind acting at different angles is conservatively neglected in calculating the Fx value for each span wire."]
["-  For calculating reactions on strain poles due wind acting at different angles, the program assumes that the angles between cables in a box arrangement are 90 degrees. Intersections in which the cable angles at the corners are within 15 degrees, plus or minus, of 90 degrees (angles of 75 to 105 degrees) should produce acceptable results."]
{"$rows_left_out":85}
{"sheet":"Input Diagrams","index":2,"n_rows":70,"n_cols":6,"rows_kept":70,"cut":false,"hidden":false,"merged":[[36,4,36,9],[69,5,69,8]]}
[]
["Input Diagrams:"]
[]
[]
[]
[]
[]
[]
[]
[]
[]
[]
[]
[]
[]
{"$rows_left_out":56}
{"sheet":"Output","index":3,"n_rows":36,"n_cols":6,"rows_kept":36,"cut":false,"hidden":false,"merged":[[27,4,27,5],[28,4,28,5],[29,4,29,5],[30,4,30,5],[33,0,34,3],[27,1,28,1],[29,1,30,1],[25,4,25,5],[26,4,26,5],[2,1,2,5],[21,2,21,3],[21,1,22,1],[3,1,3,5],[21,4,22,5],[23,4,23,5],[23,1,24,1],[25,1,26,1],[24,4,24,5]]}
["Span Wire Analysis - Output"]
[]
["Project:",{"$f":"Project","v":"Sample Input/Output"}]
["Intersection:",{"$f":"Intersection","v":"SR XX & SR XX"}]
["Input By:",{"$f":"Input_By","v":"MEC"},"Date:",{"$f":"Date_Inp","v":"2011-07-20"}]
["Checked By:",{"$f":"Checked_By","v":"XXX"},"Date:",{"$f":"Date_Chk","v":"XXX"}]
[]
["Span Wire Forces:"]
[]
[null,"Span Wire","Span Wire Tension Design Force (1)      (lbs)","Allowable Load (2) (lbs)","Check","Controlling Group Load"]
[null,"SW1",{"$f":"IF(Input!I49=\"YES\",SUMMARY!B7,\"N/A\")","v":4087.7681540382619},{"$f":"IF(Input!I49=\"YES\",SUMMARY!H7,\"N/A\")","v":7590.31},{"$f":"IF(Input!I49=\"YES\",IF(C11<=D11,\"OK\",\"NO GOOD\"),\"N/A\")","v":"OK"},{"$f":"IF(Input!I49=\"YES\",SUMMARY!C7,\"N/A\")","v":"Group II"}]
[null,"SW2",{"$f":"IF(Input!I50=\"YES\",SUMMARY!B8,\"N/A\")","v":3496.3409785513591},{"$f":"IF(Input!I50=\"YES\",SUMMARY!H8,\"N/A\")","v":7590.31},{"$f":"IF(Input!I50=\"YES\",IF(C12<=D12,\"OK\",\"NO GOOD\"),\"N/A\")","v":"OK"},{"$f":"IF(Input!I50=\"YES\",SUMMARY!C8,\"N/A\")","v":"Group II"}]
[null,"SW3",{"$f":"IF(Input!I51=\"YES\",SUMMARY!B9,\"N/A\")","v":5140.9496264381205},{"$f":"IF(Input!I51=\"YES\",SUMMARY!H9,\"N/A\")","v":7590.31},{"$f":"IF(Input!I51=\"YES\",IF(C13<=D13,\"OK\",\"NO GOOD\"),\"N/A\")","v":"OK"},{"$f":"IF(Input!I51=\"YES\",SUMMARY!C9,\"N/A\")","v":"Group II"}]
[null,"SW4",{"$f":"IF(Input!I52=\"YES\",SUMMARY!B10,\"N/A\")","v":2250.2447015876501},{"$f":"IF(Input!I52=\"YES\",SUMMARY!H10,\"N/A\")","v":7590.31},{"$f":"IF(Input!I52=\"YES\",IF(C14<=D14,\"OK\",\"NO GOOD\"),\"N/A\")","v":"OK"},{"$f":"IF(Input!I52=\"YES\",SUMMARY!C10,\"N/A\")","v":"Group II"}]
[]
{"$rows_left_out":22}
{"sheet":"SW1","index":4,"n_rows":409,"n_cols":9,"rows_kept":409,"cut":false,"hidden":false,"merged":[[398,3,398,5],[398,0,398,2],[398,6,399,8],[405,2,405,4],[2,1,2,8],[48,2,53,2],[25,0,25,8],[4,1,6,4],[20,4,20,5],[218,6,218,7],[162,1,162,5]]}
["Strain Pole Design - SW1 Cable Stringing Tension"]
[]
["Assumptions:","This spreadsheet calculates the tension in strain poles for overhead sign in accordance with the AASHTO Specifications for Structural Supports for Highway Signs, Luminaires and Traffic Signals 4th Edition 2001, including the 2002 and 2003 Interims (Per DM-4), and the Pennsylvania Department of Transportation Criteria for the Design of Traffic Related Structures."]
[]
[null,"Number of assumed concentrated loads on the strain pole cable.  Also must consider concentrated cable loads with a minimum of 5 segments.",null,null,null," "," ",null,"Y"]
[null,null,null,null,null,"=",{"$f":"I51","v":11}]
[null,null,null,null,null,null,null,"M"]
[]
[null,"Support 1 (Left)",null,null,null,null,"X",null,"Support 2 (Right)      "]
[]
[]
[]
[null,null,null,null,null,null,"Loadn"]
[]
[]
{"$rows_left_out":395}
{"sheet":"SW2","index":5,"n_rows":409,"n_cols":9,"rows_kept":409,"cut":false,"hidden":false,"merged":[[162,1,162,5],[2,1,2,8],[4,1,6,4],[20,4,20,5],[25,0,25,8],[48,2,53,2],[218,6,218,7],[398,0,398,2],[398,3,398,5],[398,6,399,8],[405,2,405,4]]}
["Strain Pole Design - SW2 Cable Stringing Tension"]
[]
["Assumptions:","This spreadsheet calculates the tension in strain poles for overhead sign in accordance with the AASHTO Specifications for Structural Supports for Highway Signs, Luminaires and Traffic Signals 4th Edition 2001, including the 2002 and 2003 Interims (Per DM-4), and the Pennsylvania Department of Transportation Criteria for the Design of Traffic Related Structures."]
[]
[null,"Number of assumed concentrated loads on the strain pole cable.  Also must consider concentrated cable loads with a minimum of 5 segments.",null,null,null," "," ",null,"Y"]
[null,null,null,null,null,"=",{"$f":"I51","v":12}]
[null,null,null,null,null,null,null,"M"]
[]
[null,"Support 1 (Left)",null,null,null,null,"X",null,"Support 2 (Right)      "]
[]
[]
[]
[null,null,null,null,null,null,"Loadn"]
[]
[]
{"$rows_left_out":395}
{"sheet":"SW3","index":6,"n_rows":409,"n_cols":9,"rows_kept":409,"cut":false,"hidden":false,"merged":[[162,1,162,5],[2,1,2,8],[4,1,6,4],[20,4,20,5],[25,0,25,8],[48,2,53,2],[218,6,218,7],[398,0,398,2],[398,3,398,5],[398,6,399,8],[405,2,405,4]]}
["Strain Pole Design - SW3 Cable Stringing Tension"]
[]
["Assumptions:","This spreadsheet calculates the tension in strain poles for overhead sign in accordance with the AASHTO Specifications for Structural Supports for Highway Signs, Luminaires and Traffic Signals 4th Edition 2001, including the 2002 and 2003 Interims (Per DM-4), and the Pennsylvania Department of Transportation Criteria for the Design of Traffic Related Structures."]
[]
[null,"Number of assumed concentrated loads on the strain pole cable.  Also must consider concentrated cable loads with a minimum of 5 segments.",null,null,null," "," ",null,"Y"]
[null,null,null,null,null,"=",{"$f":"I51","v":11}]
[null,null,null,null,null,null,null,"M"]
[]
[null,"Support 1 (Left)",null,null,null,null,"X",null,"Support 2 (Right)      "]
[]
[]
[]
[null,null,null,null,null,null,"Loadn"]
[]
[]
{"$rows_left_out":395}
{"sheet":"SW4","index":7,"n_rows":409,"n_cols":9,"rows_kept":409,"cut":false,"hidden":false,"merged":[[162,1,162,5],[2,1,2,8],[4,1,6,4],[20,4,20,5],[25,0,25,8],[48,2,53,2],[218,6,218,7],[398,0,398,2],[398,3,398,5],[398,6,399,8],[405,2,405,4]]}
["Strain Pole Design - SW4 Cable Stringing Tension"]
[]
["Assumptions:","This spreadsheet calculates the tension in strain poles for overhead sign in accordance with the AASHTO Specifications for Structural Supports for Highway Signs, Luminaires and Traffic Signals 4th Edition 2001, including the 2002 and 2003 Interims (Per DM-4), and the Pennsylvania Department of Transportation Criteria for the Design of Traffic Related Structures."]
[]
[null,"Number of assumed concentrated loads on the strain pole cable.  Also must consider concentrated cable loads with a minimum of 5 segments.",null,null,null," "," ",null,"Y"]
[null,null,null,null,null,"=",{"$f":"I51","v":12}]
[null,null,null,null,null,null,null,"M"]
[]
[null,"Support 1 (Left)",null,null,null,null,"X",null,"Support 2 (Right)      "]
[]
[]
[]
[null,null,null,null,null,null,"Loadn"]
[]
[]
{"$rows_left_out":395}
{"sheet":"P1","index":8,"n_rows":53,"n_cols":8,"rows_kept":53,"cut":false,"hidden":false,"merged":[[2,6,3,8],[13,1,13,3],[24,1,24,3],[35,1,35,3],[2,0,2,2],[2,3,2,5],[52,4,53,8],[13,4,13,5],[24,4,24,5],[35,4,35,5],[24,6,25,8],[13,6,14,8],[35,6,36,8],[49,4,49,6]]}
["P1 Reactions (Loads Due to SW4 & SW1)"]
[]
["SW4 - Support 2 (Right)",null,null,"SW1 - Support 1 (Left)",null,null,"Group Load"]
["Fx","Fy","Fz","Fx","Fy","Fz"]
[{"$f":"'SW4'!D401","v":1900.17578125},{"$f":"'SW4'!E401","v":332.765625},{"$f":"'SW4'!F401","v":0},{"$f":"'SW1'!A401","v":1759.830636209399},{"$f":"'SW1'!B401","v":249.86207450224794},{"$f":"'SW1'!C401","v":0},"Group I","(DL)"]
[{"$f":"'SW4'!D402","v":1693.4006597319199},{"$f":"'SW4'!E402","v":332.765625},{"$f":"'SW4'!F402","v":1444.0437879306671},{"$f":"'SW1'!A402","v":3804.8368981276994},{"$f":"'SW1'!B402","v":249.86207450224794},{"$f":"'SW1'!C402","v":876.55718433431832},"Group II","(DL + WL)"]
[{"$f":"'SW4'!D403","v":1208.8702142936243},{"$f":"'SW4'!E403","v":556.31093750000014},{"$f":"'SW4'!F403","v":722.02189396533356},{"$f":"'SW1'!A403","v":2468.3083891027918},{"$f":"'SW1'!B403","v":415.77330122029548},{"$f":"'SW1'!C403","v":438.27859216715916},"Group III","(DL + IL + 0.5 · WL)"]
[]
["Case 1 Wind at 90˚ to SW4"]
["FX = 1.0 · FX SW4 + 0.0 · FZ SW1"]
["FY = 1.0 · FY SW4 + 1.0 · FY SW1"]
["Fz = 1.0 · FX SW1 + 1.0 · FZ SW4  + 0.2 FZ SW1"]
[]
[null,"Pole Reactions",null,null,"Resultants",null,"Group Load"]
[null,"Fx","Fy","Fz","Horizontal","Vertical"]
{"$rows_left_out":39}
{"sheet":"P2","index":9,"n_rows":53,"n_cols":8,"rows_kept":53,"cut":false,"hidden":false,"merged":[[52,4,53,8],[24,1,24,3],[24,4,24,5],[24,6,25,8],[35,1,35,3],[35,4,35,5],[35,6,36,8],[49,4,49,6],[2,0,2,2],[2,3,2,5],[2,6,3,8],[13,1,13,3],[13,4,13,5],[13,6,14,8]]}
["P2 Reactions (Loads Due to SW1 & SW2)"]
[]
["SW1 - Support 2 (Right)",null,null,"SW2 - Support 1 (Left)",null,null,"Group Load"]
["Fx","Fy","Fz","Fx","Fy","Fz"]
[{"$f":"'SW1'!D401","v":1759.830636209399},{"$f":"'SW1'!E401","v":342.88792549775206},{"$f":"'SW1'!F401","v":0},{"$f":"'SW2'!A401","v":1956.9512485136743},{"$f":"'SW2'!B401","v":263.36551724137934},{"$f":"'SW2'!C401","v":0},"Group I","(DL)"]
[{"$f":"'SW1'!D402","v":3804.8368981276994},{"$f":"'SW1'!E402","v":342.88792549775206},{"$f":"'SW1'!F402","v":1454.4732827945704},{"$f":"'SW2'!A402","v":3039.2446466371084},{"$f":"'SW2'!B402","v":263.36551724137934},{"$f":"'SW2'!C402","v":1026.0473303981607},"Group II","(DL + WL)"]
[{"$f":"'SW1'!D403","v":2468.3083891027918},{"$f":"'SW1'!E403","v":569.20669877970454},{"$f":"'SW1'!F403","v":727.23664139728521},{"$f":"'SW2'!A403","v":2024.1422013904612},{"$f":"'SW2'!B403","v":444.04137931034484},{"$f":"'SW2'!C403","v":513.02366519908037},"Group III","(DL + IL + 0.5 · WL)"]
[]
["Case 1 Wind at 90˚ to SW1"]
["FX = 1.0 · FX SW1 + 0.0 · FZ SW2"]
["FY = 1.0 · FY SW1 + 1.0 · FY SW2"]
["Fz = 1.0 · FX SW2 + 1.0 · FZ SW1  + 0.2 FZ SW2"]
[]
[null,"Pole Reactions",null,null,"Resultants",null,"Group Load"]
[null,"Fx","Fy","Fz","Horizontal","Vertical"]
{"$rows_left_out":39}
{"sheet":"P3","index":10,"n_rows":53,"n_cols":8,"rows_kept":53,"cut":false,"hidden":false,"merged":[[52,4,53,8],[24,1,24,3],[24,4,24,5],[24,6,25,8],[35,1,35,3],[35,4,35,5],[35,6,36,8],[49,4,49,6],[2,0,2,2],[2,3,2,5],[2,6,3,8],[13,1,13,3],[13,4,13,5],[13,6,14,8]]}
["P3 Reactions (Loads Due to SW2 & SW3)"]
[]
["SW2 - Support 2 (Right)",null,null,"SW3 - Support 1 (Left)",null,null,"Group Load"]
["Fx","Fy","Fz","Fx","Fy","Fz"]
[{"$f":"'SW2'!D401","v":1956.9512485136743},{"$f":"'SW2'!E401","v":369.13448275862066},{"$f":"'SW2'!F401","v":0},{"$f":"'SW3'!A401","v":1828.8107266435986},{"$f":"'SW3'!B401","v":259.69558823529411},{"$f":"'SW3'!C401","v":0},"Group I","(DL)"]
[{"$f":"'SW2'!D402","v":3039.2446466371084},{"$f":"'SW2'!E402","v":369.13448275862066},{"$f":"'SW2'!F402","v":1688.5295229351718},{"$f":"'SW3'!A402","v":4937.1393266081068},{"$f":"'SW3'!B402","v":259.69558823529411},{"$f":"'SW3'!C402","v":932.30087988705884},"Group II","(DL + WL)"]
[{"$f":"'SW2'!D403","v":2024.1422013904612},{"$f":"'SW2'!E403","v":625.06862068965518},{"$f":"'SW2'!F403","v":844.26476146758591},{"$f":"'SW3'!A403","v":3176.3446417717596},{"$f":"'SW3'!B403","v":433.39541176470584},{"$f":"'SW3'!C403","v":466.15043994352942},"Group III","(DL + IL + 0.5 · WL)"]
[]
["Case 1 Wind at 90˚ to SW2"]
["FX = 1.0 · FX SW2 + 0.0 · FZ SW3"]
["FY = 1.0 · FY SW2 + 1.0 · FY SW3"]
["Fz = 1.0 · FX SW3 + 1.0 · FZ SW2  + 0.2 FZ SW3"]
[]
[null,"Pole Reactions",null,null,"Resultants",null,"Group Load"]
[null,"Fx","Fy","Fz","Horizontal","Vertical"]
{"$rows_left_out":39}
{"sheet":"P4","index":11,"n_rows":53,"n_cols":8,"rows_kept":53,"cut":false,"hidden":false,"merged":[[52,4,53,8],[24,1,24,3],[24,4,24,5],[24,6,25,8],[35,1,35,3],[35,4,35,5],[35,6,36,8],[49,4,49,6],[2,0,2,2],[2,3,2,5],[2,6,3,8],[13,1,13,3],[13,4,13,5],[13,6,14,8]]}
["P4 Reactions (Loads Due to SW3 & SW4)"]
[]
["SW3 - Support 2 (Right)",null,null,"SW4 - Support 1 (Left)",null,null,"Group Load"]
["Fx","Fy","Fz","Fx","Fy","Fz"]
[{"$f":"'SW3'!D401","v":1828.8107266435986},{"$f":"'SW3'!E401","v":330.17941176470589},{"$f":"'SW3'!F401","v":0},{"$f":"'SW4'!A401","v":1900.17578125},{"$f":"'SW4'!B401","v":313.859375},{"$f":"'SW4'!C401","v":0},"Group I","(DL)"]
[{"$f":"'SW3'!D402","v":4937.1393266081068},{"$f":"'SW3'!E402","v":330.17941176470589},{"$f":"'SW3'!F402","v":1394.6325276862749},{"$f":"'SW4'!A402","v":1693.4006597319199},{"$f":"'SW4'!B402","v":313.859375},{"$f":"'SW4'!C402","v":1288.7278600693332},"Group II","(DL + WL)"]
[{"$f":"'SW3'!D403","v":3176.3446417717596},{"$f":"'SW3'!E403","v":548.5595882352942},{"$f":"'SW3'!F403","v":697.31626384313745},{"$f":"'SW4'!A403","v":1208.8702142936243},{"$f":"'SW4'!B403","v":531.97406249999995},{"$f":"'SW4'!C403","v":644.36393003466662},"Group III","(DL + IL + 0.5 · WL)"]
[]
["Case 1 Wind at 90˚ to SW3"]
["FX = 1.0 · FX SW3 + 0.0 · FZ SW4"]
["FY = 1.0 · FY SW3 + 1.0 · FY SW4"]
["Fz = 1.0 · FX SW4 + 1.0 · FZ SW3  + 0.2 FZ SW4"]
[]
[null,"Pole Reactions",null,null,"Resultants",null,"Group Load"]
[null,"Fx","Fy","Fz","Horizontal","Vertical"]
{"$rows_left_out":39}
{"sheet":"SUMMARY","index":12,"n_rows":221,"n_cols":9,"rows_kept":221,"cut":false,"hidden":false,"merged":[[24,3,25,3],[18,3,19,3],[28,1,28,2],[28,3,28,5],[22,1,23,1],[22,3,23,3],[24,1,25,1],[0,0,0,8],[18,1,19,1],[20,1,21,1],[20,3,21,3],[16,4,16,6],[16,1,17,1],[16,2,17,2],[16,3,17,3]]}
["Summary of Results"]
[]
[]
["Span Wire Tension:"]
[]
["Span Wire","Controlling Tension                (lbs)","Controlling Load Group","Allowable Overstress (%)","Wire Diameter","Wire Material","Allowable Tension w/o Overstress (lbs)","Allowable Tension  w/ Overstress          (lbs)","Check"]
["SW1",{"$f":"IF(Input!I49=\"YES\",MAX('SW1'!A407:B409),\"N/A\")","v":4087.7681540382619},{"$f":"IF(Input!I49=\"YES\",IF(OR(B7='SW1'!$A$407,B7='SW1'!$A$408,B7='SW1'!$A$409),VLOOKUP(B7,'SW1'!$A$407:$E$409,3,0),VLOOKUP(B7,'SW1'!$B$407:$E$409,2,0)),\"N/A\")","v":"Group II"},{"$f":"IF(Input!I49=\"YES\",VLOOKUP(C7,'Pick Lists & Data'!$A$51:$B$53,2,0),\"N/A\")","v":1.33},{"$f":"IF(Input!I49=\"YES\",SW1_Wire_Dia,\"N/A\")","v":"0.5\""},{"$f":"IF(Input!I49=\"YES\",SW1_Wire_Material,\"N/A\")","v":"ASTM A 475"},{"$f":"IF(Input!I49=\"YES\",IF(F7='Pick Lists & Data'!$A$46,VLOOKUP(E7,'Pick Lists & Data'!$A$29:$F$33,5,0),VLOOKUP(E7,'Pick Lists & Data'!$A$29:$F$33,6,0)),\"N/A\")","v":5707},{"$f":"IF(Input!I49=\"YES\",G7*D7,\"N/A\")","v":7590.31},{"$f":"IF(Input!I49=\"YES\",IF(B7<=H7,\"OK\",\"NO GOOD\"),\"N/A\")","v":"OK"}]
["SW2",{"$f":"IF(Input!I50=\"YES\",MAX('SW2'!A407:B409),\"N/A\")","v":3496.3409785513591},{"$f":"IF(Input!I50=\"YES\",IF(OR(B8='SW2'!$A$407,B8='SW2'!$A$408,B8='SW2'!$A$409),VLOOKUP(B8,'SW2'!$A$407:$E$409,3,0),VLOOKUP(B8,'SW2'!$B$407:$E$409,2,0)),\"N/A\")","v":"Group II"},{"$f":"IF(Input!I50=\"YES\",VLOOKUP(C8,'Pick Lists & Data'!$A$51:$B$53,2,0),\"N/A\")","v":1.33},{"$f":"IF(Input!I50=\"YES\",SW2_Wire_Dia,\"N/A\")","v":"0.5\""},{"$f":"IF(Input!I50=\"YES\",SW2_Wire_Material,\"N/A\")","v":"ASTM A 475"},{"$f":"IF(Input!I50=\"YES\",IF(F8='Pick Lists & Data'!$A$46,VLOOKUP(E8,'Pick Lists & Data'!$A$29:$F$33,5,0),VLOOKUP(E8,'Pick Lists & Data'!$A$29:$F$33,6,0)),\"N/A\")","v":5707},{"$f":"IF(Input!I50=\"YES\",G8*D8,\"N/A\")","v":7590.31},{"$f":"IF(Input!I50=\"YES\",IF(B8<=H8,\"OK\",\"NO GOOD\"),\"N/A\")","v":"OK"}]
["SW3",{"$f":"IF(Input!I51=\"YES\",MAX('SW3'!A407:B409),\"N/A\")","v":5140.9496264381205},{"$f":"IF(Input!I51=\"YES\",IF(OR(B9='SW3'!$A$407,B9='SW3'!$A$408,B9='SW3'!$A$409),VLOOKUP(B9,'SW3'!$A$407:$E$409,3,0),VLOOKUP(B9,'SW3'!$B$407:$E$409,2,0)),\"N/A\")","v":"Group II"},{"$f":"IF(Input!I51=\"YES\",VLOOKUP(C9,'Pick Lists & Data'!$A$51:$B$53,2,0),\"N/A\")","v":1.33},{"$f":"IF(Input!I51=\"YES\",SW3_Wire_Dia,\"N/A\")","v":"0.5\""},{"$f":"IF(Input!I51=\"YES\",SW3_Wire_Material,\"N/A\")","v":"ASTM A 475"},{"$f":"IF(Input!I51=\"YES\",IF(F9='Pick Lists & Data'!$A$46,VLOOKUP(E9,'Pick Lists & Data'!$A$29:$F$33,5,0),VLOOKUP(E9,'Pick Lists & Data'!$A$29:$F$33,6,0)),\"N/A\")","v":5707},{"$f":"IF(Input!I51=\"YES\",G9*D9,\"N/A\")","v":7590.31},{"$f":"IF(Input!I51=\"YES\",IF(B9<=H9,\"OK\",\"NO GOOD\"),\"N/A\")","v":"OK"}]
["SW4",{"$f":"IF(Input!I52=\"YES\",MAX('SW4'!A407:B409),\"N/A\")","v":2250.2447015876501},{"$f":"IF(Input!I52=\"YES\",IF(OR(B10='SW4'!$A$407,B10='SW4'!$A$408,B10='SW4'!$A$409),VLOOKUP(B10,'SW4'!$A$407:$E$409,3,0),VLOOKUP(B10,'SW4'!$B$407:$E$409,2,0)),\"N/A\")","v":"Group II"},{"$f":"IF(Input!I52=\"YES\",VLOOKUP(C10,'Pick Lists & Data'!$A$51:$B$53,2,0),\"N/A\")","v":1.33},{"$f":"IF(Input!I52=\"YES\",SW4_Wire_Dia,\"N/A\")","v":"0.5\""},{"$f":"IF(Input!I52=\"YES\",SW4_Wire_Material,\"N/A\")","v":"ASTM A 475"},{"$f":"IF(Input!I52=\"YES\",IF(F10='Pick Lists & Data'!$A$46,VLOOKUP(E10,'Pick Lists & Data'!$A$29:$F$33,5,0),VLOOKUP(E10,'Pick Lists & Data'!$A$29:$F$33,6,0)),\"N/A\")","v":5707},{"$f":"IF(Input!I52=\"YES\",G10*D10,\"N/A\")","v":7590.31},{"$f":"IF(Input!I52=\"YES\",IF(B10<=H10,\"OK\",\"NO GOOD\"),\"N/A\")","v":"OK"}]
["N/A indicates that spanwire is not present."]
[]
["Pole Reactions:"]
[]
[]
{"$rows_left_out":207}
{"sheet":"Member Local Coordinates","index":13,"n_rows":3,"n_cols":3,"rows_kept":3,"cut":false,"hidden":false,"merged":[[2,2,2,6]]}
[]
[]
[null,null,"Member Local Coordinates"]

{"sheet":"Pick Lists & Data","index":14,"n_rows":58,"n_cols":12,"rows_kept":58,"cut":false,"hidden":false,"merged":[[49,0,49,1],[36,3,37,3],[36,4,37,4],[36,2,37,2],[36,1,37,1],[36,0,37,0],[36,6,37,6],[9,8,9,11],[10,8,12,11],[26,2,26,3],[26,4,26,5],[36,5,37,5]]}
["Wind Load Data:"]
[null,"Wind Velocity, Vfm, =",80,"mph",null,null,null,null,null,"(Pub. 149,  20.1, Section 15.2P)"]
[null,"Coefficient of Height, Ch =",1,null,null,null,null,null,null,"(A Tbl C-1, Assumes all components are between 14 and 29 feet above the ground)"]
[null,"Wind Pressure, Pz ="," 0.00256 · (1.3 · Vfm)2 · Cd · Ch",null,null,null,null,null,null,"AASHTO Appendix C.3"]
[null,"Wind Load, WL = ","Pz · Surface Area "]
[]
["Ice Load Data:"]
[null,"Ice Load =",3,"lbs/ft2",null,null,null,null,null,"AASHTO Article 3.7"]
[null,null,null,null,null,null,null,null,"Notes:"]
["Signal Configuration - Signal Sections Each Direction","Load With Back Plate (lbs)","Wind Area w/ 5\" Backplate Border (ft2)","Wind Drag Coefficient, Cd (A Tbl C-2)","Wind Pressure, Pz (psf)","Wind Load, WL (lbs)","Ice Area = 2 · Wind Area +2 ft2","Ice Load (lbs)","-For Ice Area, ice covers all sides of signal so assmue 2 · Wind Area for front and rear face and 2 ft2 for other sides of signal."]
["None",0,0,1.2,{"$f":"0.00256*(1.3*Vfm)^2*Ch*D11","v":33.226751999999998},{"$f":"E11*C11","v":0},0,{"$f":"G11*Ice","v":0},"-Dead Load and Wind Area taken in accordance with PennDOT Pub 149, Table 20-2"]
["A-3",70,8.76,1.2,{"$f":"0.00256*(1.3*Vfm)^2*Ch*D12","v":33.226751999999998},{"$f":"E12*C12","v":291.06634751999997},{"$f":"2*C12+2","v":19.52},58.56]
["A-4",89,11.04,1.2,33.226751999999998,366.82334207999992,{"$f":"2*C13+2","v":24.08},72.239999999999995]
["A-5",97,13.89,1.2,33.226751999999998,461.51958528,29.78,89.34]
["B-3",129,8.76,1.2,33.226751999999998,291.06634751999997,19.52,58.56]
{"$rows_left_out":43}