{"text_format":"1","workbook":"xlsx","n_sheets":15,"sheets":["Introduction & Revisions","Input","Input Diagrams","Output","SW1","SW2","SW3","SW4","P1","P2","P3","P4","SUMMARY","Member Local Coordinates","Pick Lists & Data"],"not_rendered":{"charts":0,"images":3,"macros":1,"external_links":0,"defined_names":59,"comments":0,"pivot_tables":0},"unopened":[],"bounds":{"document_bytes":16777216,"sheet_cells":100000,"rows_first":2000,"rows_last":500,"rows_between":2000,"halvings":0,"cell_chars":16384,"cell_head_chars":4096},"cells_cut":0,"cells_raw":0,"read":"whole","date_system":"1900"}

{"sheet":"Introduction & Revisions","index":0,"n_rows":227,"n_cols":8,"rows_kept":227,"cut":false,"hidden":false,"merged":[[0,0,0,6],[28,3,28,6],[21,3,21,6],[22,3,22,6],[23,3,23,6],[24,3,24,6],[25,3,25,6],[26,3,26,6],[27,3,27,6],[11,1,11,6],[3,1,3,6],[7,1,7,6],[12,1,12,6],[19,1,19,6],[6,1,6,6],[16,1,16,6],[17,1,17,6],[18,1,18,6],[20,1,20,6],[33,3,33,6],[29,3,29,6],[30,3,30,6],[31,3,31,6],[32,3,32,6]]}
["Span Wire Analysis"]
[]
["Introduction:"]
[null,"The purpose of this worksheet/workbook is to evaluate the various design arrangements of traffic components installed on each span wire between strain poles in order to develop the minimum required tension a strain pole must resist at any given corner of an intersection.\n                                                                                                                                                                                                                                                                                                                                             The procedure will follow the Pennsylvania Department of -Transportation \"Criteria for the Design of Traffic Related Structures\". {Per Publication 408, Section 1104.02 (a) }"]
[]
["Assumptions:"]
["  1.)","Design is in accordance with PennDOT Publications 148 and 149 and AASHTO Standard Specifications for Structural Supports for Highway Signs, Luminaries and Traffic Signals, 4th Edition with 2002 and 2003 Interims"]
["2.)","Signal Configuration & Signal Sections in Each Direction are as described in PennDOT Publication 149, Table 20-4"]
["3.)","Assume all overhead signals have 12\" lenses with backplate, 5 inch border"]
["4.)","Signal weights are in accordance with PennDOT Publication 149, Table 20-2"]
["5.)","Loading identification as shown on TC-8801, Sheet 2 of 7"]
["6.)","For calculating reactions on strain poles due to the span wires, the wind is assumed to act at 0˚, 45˚ and 90˚.   When wind acts parallel to a span wire a force of 0.2 times the wind force on that span wire is assumed to act in the direction of the wind.  The effect of the wind acting at different angles is conservatively neglected in calculating the Fx value for each span wire."]
["7.)","For calculating reactions on strain poles due wind acting at different angles, the program assumes that the angles between cables in a box arrangement are 90 degrees. Intersections in which the cable angles at the corners are within 15 degrees, plus or minus, of 90 degrees (angles of 75 to 105 degrees) should produce acceptable results."]
["8.)","Effects due to strain pole deflection are not considered when calculating span wire tension."]
[]
["Instructions:"]
["  1.)","The workbook is setup for a typical 4 span configuration.  One, two or three span configurations can also be analyzed by indicating the span wire presence and setting values to \"None\" or zero as noted in the instructions."]
["2.)","Geometry Input: On the \"Input\" tab, input the span wire length, angle between wires and if the span wire is present in the signal configuration.  Input values cells have tan fill with blue, bold and italicized font."]
["3.)","Loading Input:  On the \"Input\" tab, input the span wire load configurations from the pick lists, load locations, span wire diameter, and span wire material as indicated (Refer to Page 2 and 3 for diagrams).  If a span wire is not present in the configuration or if a given load is not present, select \"None\" from the pick list and enter \"0\" (zero) for the distance.  Any value can be entered for a span wire diameter and material if the span wire is not present."]
["4.)","Run Analysis:  To run the analysis, press the \"Run Analysis\" button at the bottom of the \"Input\" tab.  The analysis will run and the \"Output\" tab will appear."]
["5.)","Print Output:  The \"Print Output\" button will print the \"Input\" and \"Output\" tabs. Worksheets can also be printed using normal Excel printing procedures.  To view more detailed output and analysis results click on the \"SW\" or \"P\" tabs for the span wire or pole you wish to view.  More detailed output can be printed from these tabs using normal Excel printing procedures."]
[]
["VERSION #","REVISION DATE","REVISION","REASON FOR REVISION"]
["Beta","2011-10-08","Spreadsheet Originated","N/A"]
[]
[]
[]
[]
[]
[]
[]
[]
[]
[]
[]
[]
[]
[]
[]
[]
[]
[]
[]
[]
[]
[]
[]
[]
[]
[]
[]
[]
[]
[]
[]
[]
[]
[]
[]
[]
[]
[]
[]
[]
[]
[]
[]
[]
[]
[]
[]
[]
[]
[]
[]
[]
[]
[]
[]
[]
[]
[]
[]
[]
[]
[]
[]
[]
[]
[]
[]
[]
[]
[]
[]
[]
[]
[]
[]
[]
[]
[]
[]
[]
[]
[]
[]
[]
[]
[]
[]
[]
[]
[]
[]
[]
[]
[]
[]
[]
[]
[]
[]
[]
[]
[]
[]
[]
[]
[]
[]
[]
[]
[]
[]
[]
[]
[]
[]
[]
[]
[]
[]
[]
[]
[]
[]
[]
[]
[]
[]
[]
[]
[]
[]
[]
[]
[]
[]
[]
[]
[]
[]
[]
[]
[]
[]
[]
[]
[]
[]
[]
[]
[]
[]
[]
[]
[]
[]
[]
[]
[]
[]
[]
[]
[]
[]
[]
[]
[]
[]
[]
[]
[]
[]
[]
[]
[]
[]
[]
[]
[]
[]
[]
[]
[]
[]
[]
[null,null,5200]
[]
[]
[]
[]
[]
[]
[]
[]
[]
[]
[]
[]
[]
[]
[]
[]
[null,null,null,null,null,null,null,{"$f":"SUM(H212:H225)","v":0}]
[null,null,null,null,{"$f":"E157","v":0}]

{"sheet":"Input","index":1,"n_rows":99,"n_cols":21,"rows_kept":99,"cut":false,"hidden":false,"merged":[[57,3,57,5],[69,1,70,1],[69,2,70,2],[58,4,59,4],[58,5,59,5],[58,2,59,2],[58,1,59,1],[2,1,2,5],[44,4,44,5],[8,0,8,9],[3,1,3,5],[13,0,13,9],[14,0,14,9],[141,18,142,18],[141,19,142,19],[141,20,142,20],[19,18,20,18],[19,19,20,19],[19,15,20,15],[19,16,20,16],[19,17,20,17],[58,6,59,6],[58,8,59,8],[57,6,57,8],[141,17,142,17],[141,16,142,16],[98,6,98,9],[74,6,75,6],[96,8,96,9],[89,0,89,9],[85,1,86,1],[74,5,75,5],[74,4,75,4],[74,1,75,1],[74,8,75,8],[58,3,59,3],[73,3,73,5],[74,7,75,7],[85,2,86,2],[74,2,75,2],[74,3,75,3],[58,7,59,7],[73,6,73,8]]}
["Span Wire Analysis - Input"]
[]
["Project:","Sample Input/Output"]
["Intersection:","SR XX & SR XX"]
["Input By:","MEC","Date:","2011-07-20"]
["Checked By:","XXX","Date:","XXX"]
[]
["Spreadsheet Assumptions and References:"]
["- Design is in accordance with PennDOT Publications 148 and 149 and AASHTO Standard Specifications for Structural \n  Supports for Highway Signs, Luminaries and Traffic Signals, 4th Edition with 2002 and 2003 Interims"]
["- Signal Configuration & Signal Sections in Each Direction are as described in PennDOT Publication 149, Table 20-4"]
["- Assume all overhead signals have 12\" lenses with backplate, 5 inch border"]
["- Signal weights are in accordance with PennDOT Publication 149, Table 20-2"]
["- Loading identification as shown on TC-8801, Sheet 2 of 7"]
["- For calculating reactions on strain poles due to the span wires, the wind is assumed to act at 0˚, 45˚ and 90˚.   When wind acts parallel to a span wire a force of 0.2 times the wind force on that span wire is assumed to act in the direction of the wind.  The effect of the wind acting at different angles is conservatively neglected in calculating the Fx value for each span wire."]
["-  For calculating reactions on strain poles due wind acting at different angles, the program assumes that the angles between cables in a box arrangement are 90 degrees. Intersections in which the cable angles at the corners are within 15 degrees, plus or minus, of 90 degrees (angles of 75 to 105 degrees) should produce acceptable results."]
["- Effects due to strain pole deflection are not considered when calculating span wire tension."]
[]
["Geometry Input:"]
[]
[null,null,null,null,null,null,null,null,null,null,null,"Cable Length Check:",null,null,null,"Closing Side Length","Angle 1","Angle 2","Sum","Check"]
[null,null,null,null,null,null,null,null,null,null,null,"Leg","Length"]
[null,null,null,null,null,null,null,null,null,null,null,"L1",{"$f":"ROUND(C49,2)","v":173},"FT","P1",{"$f":"SQRT(M25^2+M22^2-2*M22*M25*COS(RADIANS(M29)))","v":109.10877453409454},{"$f":"ROUND(DEGREES(ASIN(M23/P23*SIN(RADIANS(M30)))),2)","v":15.46},{"$f":"ROUND(DEGREES(ASIN(M24/P25*SIN(RADIANS(M32)))),2)","v":22.18},{"$f":"ROUND(SUM(Q22:R22),2)","v":37.64},{"$f":"IF(AND(S22-1<M29,S22+1>M29),\"OK\",\"ERROR\")","v":"OK"},{"$f":"IF(T22=\"OK\",1,0)","v":1}]
[null,null,null,null,null,null,null,null,null,null,null,"L2",{"$f":"ROUND(C50,2)","v":145},"FT","P2",{"$f":"SQRT(M22^2+M23^2-2*M22*M23*COS(RADIANS(M30)))","v":304.21508019012873},{"$f":"ROUND(DEGREES(ASIN(M25/P22*SIN(RADIANS(M29)))),2)","v":64.53},{"$f":"ROUND(DEGREES(ASIN(M24/P24*SIN(RADIANS(M31)))),2)","v":83.13},{"$f":"ROUND(SUM(Q23:R23),2)","v":147.66},{"$f":"IF(AND(S23-1<M30,S23+1>M30),\"OK\",\"ERROR\")","v":"ERROR"},{"$f":"IF(T23=\"OK\",1,0)","v":0}]
[null,null,null,null,null,null,null,null,null,null,null,"L3",{"$f":"ROUND(C51,2)","v":170},"FT","P3",{"$f":"SQRT(M23^2+M24^2-2*M23*M24*COS(RADIANS(M31)))","v":107.75761736495168},{"$f":"ROUND(DEGREES(ASIN(M22/P23*SIN(RADIANS(M30)))),2)","v":18.54},{"$f":"ROUND(DEGREES(ASIN(M25/P25*SIN(RADIANS(M32)))),2)","v":20.82},{"$f":"ROUND(SUM(Q24:R24),2)","v":39.36},{"$f":"IF(AND(S24-1<M31,S24+1>M31),\"OK\",\"ERROR\")","v":"OK"},{"$f":"IF(T24=\"OK\",1,0)","v":1}]
[null,null,null,null,null,null,null,null,null,null,null,"L4",{"$f":"ROUND(C52,2)","v":160},"FT","P4",{"$f":"SQRT(M24^2+M25^2-2*M24*M25*COS(RADIANS(M32)))","v":307.05967069623921},{"$f":"ROUND(DEGREES(ASIN(M22/P22*SIN(RADIANS(M29)))),2)","v":77.47},{"$f":"ROUND(DEGREES(ASIN(M23/P24*SIN(RADIANS(M31)))),2)","v":57.87},{"$f":"ROUND(SUM(Q25:R25),2)","v":135.34},{"$f":"IF(AND(S25-1<M32,S25+1>M32),\"OK\",\"ERROR\")","v":"ERROR"},{"$f":"IF(T25=\"OK\",1,0)","v":0}]
[null,null,null,null,null,null,null,null,null,null,null,null,null,null," ",null,null,null,null,"Total =",{"$f":"SUM(U22:U25)","v":2}]
[null,null,null,null,null,null,null,null,null,null,null,null,null,null,"Error: Geometry is incorrect, shape is not closed."]
[null,null,null,null,null,null,null,null,null,null,null,"Angle Check:"]
[null,null,null,null,null,null,null,null,null,null,null,"A1",{"$f":"ROUND(F49,2)","v":38},"DEG"]
[null,null,null,null,null,null,null,null,null,null,null,"A2",{"$f":"ROUND(F50,2)","v":146},"DEG"]
[null,null,null,null,null,null,null,null,null,null,null,"A3",{"$f":"ROUND(F51,2)","v":39},"DEG"]
[null,null,null,null,null,null,null,null,null,null,null,"A4",{"$f":"ROUND(F52,2)","v":137},"DEG"]
[null,null,null,null,null,null,null,null,null,null,null,"Total =",{"$f":"SUM(M29:M32)","v":360},"DEG"," "]
[null,null,null,null,null,null,null,null,null,null,null,null,null,null,"Error: Sum of angles does not equal 360˚"]
[]
[]
[]
[]
[]
[]
[]
[]
[]
[]
[null,null,null,null,"Intersection Plan View"]
[]
[null,"Input values to the nearest two decimal places and YES or NO if the span wire is present in the signal layout."]
[null,"Leg Length Input:",null,null,"Angle Input:",null,null,"Span Wire Present:"]
[null,"L1 =",173,"ft","A1 =",38,"degrees","SW1:","YES"]
[null,"L2 =",145,"ft","A2 =",146,"degrees","SW2:","YES"]
[null,"L3 =",170,"ft","A3 =",39,"degrees","SW3:","YES"]
[null,"L4 =",160,"ft","A4 =",137,"degrees","SW4:","YES"]
[null,null,null,null,{"$f":"IF(AND(I49='Pick Lists & Data'!A57,I50='Pick Lists & Data'!A57,I51='Pick Lists & Data'!A57,I52='Pick Lists & Data'!A57),IF(M33=360,O33,O34),\" \")","v":" "}]
[null,null,null,null,{"$f":"IF(AND(I49='Pick Lists & Data'!A57,I50='Pick Lists & Data'!A57,I51='Pick Lists & Data'!A57,I52='Pick Lists & Data'!A57),IF(U26=4,O26,O27),\" \")","v":"Error: Geometry is incorrect, shape is not closed."}]
[null,null,null,null,null,null,null,null,null,null,null,null,"PICK LISTS:"]
["Loading Input:",null,null,null,null,null,null,null,null,null,null,null,"Spanwire Present:","Signals:","Signs","Wire Diameter","Wire Material"]
[null,null,null,null,null,null,null,null,null,null,null,null,"YES","None","None","0.25\"","ASTM A 475"]
[null,null,null,"Span Wire SW-1 Input",null,null,"Span Wire SW-2 Input",null,null,null,null,null,"NO","A-3","30\" x 36\"","0.3125\"","ASTM B 416"]
[null,"Loading ID","Description","Sign Size/Wire Size (in)","Signal Config. - Signal Sec. Each Direction (3)","Distance (Xn), ft (1)","Sign Size/Wire Size (in)","Signal Config. - Signal Sec. Each Direction (3)","Distance (Xn), ft (1)",null,null,null,null,"A-4","None","0.375\""]
[null,null,null,null,null,null,null,null,null,null,null,null,null,"A-5","72\" x 21\"","0.4375\""]
[null,"M","Signal",null,"A-3",131,null,"A-3",117,null,null,null,null,"B-3","96\" x 32\"","0.5\""]
[null,"N","Signal",null,"A-3",89,null,"A-3",70,null,null,null,null,"C-3"]
[null,"O","Signal",null,"A-3",68,null,"A-3",55,null,null,null,null,"B-4"]
[null,"P","Signal",null,"A-3",51,null,"A-5",42,null,null,null,null,"C-4"]
[null,"R","Sign","30\" x 36\"",null,79,"30\" x 36\"",null,65,null,null,null,null,"B-5"]
[null,"S","Sign","None",null,0,"30\" x 36\"",null,36,null,null,null,null,"D-3"]
[null,"T","Sign","None",null,0,"None",null,0,null,null,null,null,"E-3"]
[null,"U","Sign","None",null,0,"None",null,0,null,null,null,null,"D-4"]
[null,"Y","Sign","96\" x 32\"",null,22,"96\" x 32\"",null,30,null,null,null,null,"E-4"]
[null,"Wire","Wire","0.5\"",null,null,"0.5\"",null,null,null,null,null,null,"F-3"]
[null,null,null,"Material (2):","ASTM A 475",null,"Material (2):","ASTM A 475",null,null,null,null,null,"F-4"]
[]
[]
[null,null,null,"Span Wire SW-3 Input",null,null,"Span Wire SW-4 Input"]
[null,"Loading ID","Description","Sign Size/Wire Size (in)","Signal Config. - Signal Sec. Each Direction (3)","Distance (Xn), ft (1)","Sign Size/Wire Size (in)","Signal Config. - Signal Sec. Each Direction (3)","Distance (Xn), ft (1)"]
[]
[null,"M","Signal",null,"A-3",129,null,"A-5",120]
[null,"N","Signal",null,"A-3",90,null,"A-3",95]
[null,"O","Signal",null,"A-3",75,null,"A-3",72]
[null,"P","Signal",null,"A-3",55,null,"A-3",50]
[null,"R","Sign","30\" x 36\"",null,83,"30\" x 36\"",null,125]
[null,"S","Sign","None",null,0,"30\" x 36\"",null,90]
[null,"T","Sign","None",null,0,"None",null,0]
[null,"U","Sign","None",null,0,"None",null,0]
[null,"Y","Sign","96\" x 32\"",null,27,"96\" x 32\"",null,27]
[null,"Wire","Wire","0.5\"",null,null,"0.5\""]
[null,null,null,"Material (2):","ASTM A 475",null,"Material (2):","ASTM A 475"]
[]
[]
["(1) Enter distance measured from the right support to the load location as if you are looking at the span wire from the roadway being signaled.  The program as written assumes that the roadway being signaled is on the opposite side of the intersection from the span wire.  If all loads are not used, enter a zero distance for each load not being used"]
["(2) ASTM A 475,Class A, Siemens-Martin Grade or ASTM B 416"]
["(3)   A - 3"]
[]
[null,"Number of signal sections, each direction"]
[null,"Signal Configuration, PennDOT Pub. 149, Figure 20-4"]
[]
[null,null,null,null,null,null,"A-3","A-4","A-5"]
[]
[null,null,null,null,null,null,"Examples"]

{"sheet":"Input Diagrams","index":2,"n_rows":70,"n_cols":6,"rows_kept":70,"cut":false,"hidden":false,"merged":[[36,4,36,9],[69,5,69,8]]}
[]
["Input Diagrams:"]
[]
[]
[]
[]
[]
[]
[]
[]
[]
[]
[]
[]
[]
[]
[]
[]
[]
[]
[]
[]
[]
[]
[]
[]
[]
[]
[]
[]
[]
[]
[]
[]
[]
[]
[null,null,null,null,"Typical Elevation (TC-8801, Sheet 2 of 7)"]
[]
[]
[]
[]
[]
[]
[]
[]
[]
[]
[]
[]
[]
[]
[]
[]
[]
[]
[]
[]
[]
[]
[]
[]
[]
[]
[]
[]
[]
[]
[]
[]
[null,null,null,null,null,"PennDOT Pub 149, Figure 20-4:"]

{"sheet":"Output","index":3,"n_rows":36,"n_cols":6,"rows_kept":36,"cut":false,"hidden":false,"merged":[[27,4,27,5],[28,4,28,5],[29,4,29,5],[30,4,30,5],[33,0,34,3],[27,1,28,1],[29,1,30,1],[25,4,25,5],[26,4,26,5],[2,1,2,5],[21,2,21,3],[21,1,22,1],[3,1,3,5],[21,4,22,5],[23,4,23,5],[23,1,24,1],[25,1,26,1],[24,4,24,5]]}
["Span Wire Analysis - Output"]
[]
["Project:",{"$f":"Project","v":"Sample Input/Output"}]
["Intersection:",{"$f":"Intersection","v":"SR XX & SR XX"}]
["Input By:",{"$f":"Input_By","v":"MEC"},"Date:",{"$f":"Date_Inp","v":"2011-07-20"}]
["Checked By:",{"$f":"Checked_By","v":"XXX"},"Date:",{"$f":"Date_Chk","v":"XXX"}]
[]
["Span Wire Forces:"]
[]
[null,"Span Wire","Span Wire Tension Design Force (1)      (lbs)","Allowable Load (2) (lbs)","Check","Controlling Group Load"]
[null,"SW1",{"$f":"IF(Input!I49=\"YES\",SUMMARY!B7,\"N/A\")","v":4087.7681540382619},{"$f":"IF(Input!I49=\"YES\",SUMMARY!H7,\"N/A\")","v":7590.31},{"$f":"IF(Input!I49=\"YES\",IF(C11<=D11,\"OK\",\"NO GOOD\"),\"N/A\")","v":"OK"},{"$f":"IF(Input!I49=\"YES\",SUMMARY!C7,\"N/A\")","v":"Group II"}]
[null,"SW2",{"$f":"IF(Input!I50=\"YES\",SUMMARY!B8,\"N/A\")","v":3496.3409785513591},{"$f":"IF(Input!I50=\"YES\",SUMMARY!H8,\"N/A\")","v":7590.31},{"$f":"IF(Input!I50=\"YES\",IF(C12<=D12,\"OK\",\"NO GOOD\"),\"N/A\")","v":"OK"},{"$f":"IF(Input!I50=\"YES\",SUMMARY!C8,\"N/A\")","v":"Group II"}]
[null,"SW3",{"$f":"IF(Input!I51=\"YES\",SUMMARY!B9,\"N/A\")","v":5140.9496264381205},{"$f":"IF(Input!I51=\"YES\",SUMMARY!H9,\"N/A\")","v":7590.31},{"$f":"IF(Input!I51=\"YES\",IF(C13<=D13,\"OK\",\"NO GOOD\"),\"N/A\")","v":"OK"},{"$f":"IF(Input!I51=\"YES\",SUMMARY!C9,\"N/A\")","v":"Group II"}]
[null,"SW4",{"$f":"IF(Input!I52=\"YES\",SUMMARY!B10,\"N/A\")","v":2250.2447015876501},{"$f":"IF(Input!I52=\"YES\",SUMMARY!H10,\"N/A\")","v":7590.31},{"$f":"IF(Input!I52=\"YES\",IF(C14<=D14,\"OK\",\"NO GOOD\"),\"N/A\")","v":"OK"},{"$f":"IF(Input!I52=\"YES\",SUMMARY!C10,\"N/A\")","v":"Group II"}]
[]
["(1) Forces have NOT been adjusted for overstress."]
["(2) Allowable load includes allowable group overstress."]
["(3) N/A indicates that no span wire is present."]
[]
["Pole Design Forces:"]
[]
[null,"Pole Number","Pole Design\nForce (1) (lbs)",null,"Controlling Load Group (2)"]
[null,null,"Horiz","Vertical"]
[null,"P1",{"$f":"IF(AND(Input!$I$49=\"NO\",Input!$I$52=\"NO\"),\"N/A\",SUMMARY!F19)","v":2589.9173476754477},{"$f":"IF(AND(Input!$I$49=\"NO\",Input!$I$52=\"NO\"),\"N/A\",SUMMARY!G19)","v":582.62769950224788},{"$f":"IF(AND(Input!$I$49=\"NO\",Input!$I$52=\"NO\"),\"N/A\",SUMMARY!E19)","v":"Group I (DL Only)"}]
[null,null,{"$f":"IF(AND(Input!$I$49=\"NO\",Input!$I$52=\"NO\"),\"N/A\",SUMMARY!F20)","v":5682.3820692368636},{"$f":"IF(AND(Input!$I$49=\"NO\",Input!$I$52=\"NO\"),\"N/A\",SUMMARY!G20)","v":582.62769950224788},{"$f":"IF(AND(Input!$I$49=\"NO\",Input!$I$52=\"NO\"),\"N/A\",SUMMARY!E20)","v":"Group II"}]
[null,"P2",{"$f":"IF(AND(Input!$I$49=\"NO\",Input!$I$50=\"NO\"),\"N/A\",SUMMARY!F21)","v":2631.8552500470855},{"$f":"IF(AND(Input!$I$49=\"NO\",Input!$I$50=\"NO\"),\"N/A\",SUMMARY!G21)","v":606.2534427391314},{"$f":"IF(AND(Input!$I$49=\"NO\",Input!$I$50=\"NO\"),\"N/A\",SUMMARY!E21)","v":"Group I (DL Only)"}]
[null,null,{"$f":"IF(AND(Input!$I$49=\"NO\",Input!$I$50=\"NO\"),\"N/A\",SUMMARY!F22)","v":6338.3932110078285},{"$f":"IF(AND(Input!$I$49=\"NO\",Input!$I$50=\"NO\"),\"N/A\",SUMMARY!G22)","v":606.2534427391314},{"$f":"IF(AND(Input!$I$49=\"NO\",Input!$I$50=\"NO\"),\"N/A\",SUMMARY!E22)","v":"Group II"}]
[null,"P3",{"$f":"IF(AND(Input!$I$50=\"NO\",Input!$I$51=\"NO\"),\"N/A\",SUMMARY!F23)","v":2678.4709934860066},{"$f":"IF(AND(Input!$I$50=\"NO\",Input!$I$51=\"NO\"),\"N/A\",SUMMARY!G23)","v":628.83007099391477},{"$f":"IF(AND(Input!$I$50=\"NO\",Input!$I$51=\"NO\"),\"N/A\",SUMMARY!E23)","v":"Group I (DL Only)"}]
[null,null,{"$f":"IF(AND(Input!$I$50=\"NO\",Input!$I$51=\"NO\"),\"N/A\",SUMMARY!F24)","v":7459.36390602133},{"$f":"IF(AND(Input!$I$50=\"NO\",Input!$I$51=\"NO\"),\"N/A\",SUMMARY!G24)","v":628.83007099391477},{"$f":"IF(AND(Input!$I$50=\"NO\",Input!$I$51=\"NO\"),\"N/A\",SUMMARY!E24)","v":"Group II"}]
[null,"P4",{"$f":"IF(AND(Input!$I$51=\"NO\",Input!$I$52=\"NO\"),\"N/A\",SUMMARY!F25)","v":2637.2744782323539},{"$f":"IF(AND(Input!$I$51=\"NO\",Input!$I$52=\"NO\"),\"N/A\",SUMMARY!G25)","v":644.03878676470595},{"$f":"IF(AND(Input!$I$51=\"NO\",Input!$I$52=\"NO\"),\"N/A\",SUMMARY!E25)","v":"Group I (DL Only)"}]
[null,null,{"$f":"IF(AND(Input!$I$51=\"NO\",Input!$I$52=\"NO\"),\"N/A\",SUMMARY!F26)","v":6721.6029913002594},{"$f":"IF(AND(Input!$I$51=\"NO\",Input!$I$52=\"NO\"),\"N/A\",SUMMARY!G26)","v":644.03878676470595},{"$f":"IF(AND(Input!$I$51=\"NO\",Input!$I$52=\"NO\"),\"N/A\",SUMMARY!E26)","v":"Group II"}]
[]
["(1) Forces have NOT been adjusted for overstress."]
["(2) Group 1 (Dead Load only and Load Group with the controlling shear value are reported.)"]
[]
["(3) N/A indicates that no span wires are present at that pole."]

{"sheet":"SW1","index":4,"n_rows":409,"n_cols":9,"rows_kept":409,"cut":false,"hidden":false,"merged":[[398,3,398,5],[398,0,398,2],[398,6,399,8],[405,2,405,4],[2,1,2,8],[48,2,53,2],[25,0,25,8],[4,1,6,4],[20,4,20,5],[218,6,218,7],[162,1,162,5]]}
["Strain Pole Design - SW1 Cable Stringing Tension"]
[]
["Assumptions:","This spreadsheet calculates the tension in strain poles for overhead sign in accordance with the AASHTO Specifications for Structural Supports for Highway Signs, Luminaires and Traffic Signals 4th Edition 2001, including the 2002 and 2003 Interims (Per DM-4), and the Pennsylvania Department of Transportation Criteria for the Design of Traffic Related Structures."]
[]
[null,"Number of assumed concentrated loads on the strain pole cable.  Also must consider concentrated cable loads with a minimum of 5 segments.",null,null,null," "," ",null,"Y"]
[null,null,null,null,null,"=",{"$f":"I51","v":11}]
[null,null,null,null,null,null,null,"M"]
[]
[null,"Support 1 (Left)",null,null,null,null,"X",null,"Support 2 (Right)      "]
[]
[]
[]
[null,null,null,null,null,null,"Loadn"]
[]
[]
[]
[null,null,null,null,null,null,"Xn"]
[]
[null,null,null,null,"Length"]
[]
[null,"Length:",{"$f":"L1_","v":173},"feet","Maximum Allowable Sag:",null,5,"percent"]
[]
[]
["Rank loading ID's from right to left ( Support 2 to Support 1) and calculate wire segment lengths:"]
[]
["The spreadsheet assumes that 3 wire segments are placed before the first point load and 2 wire segments are placed after the last point load.  The number of point loads is calculated by adding the number of point loads input and adding 5 point loads due to the wire segments."]
[]
[null,"Original Rank w/o Wire","Re-rank","Final Rank","Loading ID","Distance"]
[null,{"$f":"IF(F29<>\"N/A\",RANK(F29,$F$29:$F$37,1),\"Exclude\")","v":6},{"$f":"IF(ISNUMBER(B29)=TRUE,B29,MAX($B$29:$B$37)+1)","v":6},{"$f":"RANK(C29,$C$29:$C$37,1)","v":6},"M",{"$f":"IF(Input!E61=\"None\",\"N/A\",Input!F61)","v":131}]
[null,5,{"$f":"IF(ISNUMBER(B30)=TRUE,B30,MAX($B$29:$B$37)+2)","v":5},5,"N",{"$f":"IF(Input!E62=\"None\",\"N/A\",Input!F62)","v":89}]
[null,3,{"$f":"IF(ISNUMBER(B31)=TRUE,B31,MAX($B$29:$B$37)+3)","v":3},3,"O",{"$f":"IF(Input!E63=\"None\",\"N/A\",Input!F63)","v":68}]
[null,2,{"$f":"IF(ISNUMBER(B32)=TRUE,B32,MAX($B$29:$B$37)+4)","v":2},2,"P",{"$f":"IF(Input!E64=\"None\",\"N/A\",Input!F64)","v":51}]
[null,4,{"$f":"IF(ISNUMBER(B33)=TRUE,B33,MAX($B$29:$B$37)+5)","v":4},4,"R",{"$f":"IF(Input!D65=\"None\",\"N/A\",Input!F65)","v":79}]
[null,"Exclude",{"$f":"IF(ISNUMBER(B34)=TRUE,B34,MAX($B$29:$B$37)+6)","v":12},7,"S",{"$f":"IF(Input!D66=\"None\",\"N/A\",Input!F66)","v":"N/A"}]
[null,"Exclude",{"$f":"IF(ISNUMBER(B35)=TRUE,B35,MAX($B$29:$B$37)+7)","v":13},8,"T",{"$f":"IF(Input!D67=\"None\",\"N/A\",Input!F67)","v":"N/A"}]
[null,"Exclude",{"$f":"IF(ISNUMBER(B36)=TRUE,B36,MAX($B$29:$B$37)+8)","v":14},9,"U",{"$f":"IF(Input!D68=\"None\",\"N/A\",Input!F68)","v":"N/A"}]
[null,1,{"$f":"IF(ISNUMBER(B37)=TRUE,B37,MAX($B$29:$B$37)+9)","v":1},1,"Y",{"$f":"IF(Input!D69=\"None\",\"N/A\",Input!F69)","v":22}]
[]
[null,null,"Rank","Loading ID","Distance","Count"]
[null,null,1,{"$f":"VLOOKUP(C40,$D$29:$F$37,2,0)","v":"Y"},{"$f":"VLOOKUP(C40,$D$29:$F$37,3,0)","v":22},{"$f":"IF(E40<>\"N/A\",1,0)","v":1}]
[null,null,2,"P",51,1]
[null,null,3,"O",68,1]
[null,null,4,"R",79,1]
[null,null,5,"N",89,1]
[null,null,6,"M",131,1]
[null,null,7,"S","N/A",0]
[null,null,8,"T","N/A",0]
[null,null,9,"U","N/A",0]
[null,null,"Wire Sections","W1",{"$f":"MIN(E40:E48)/3","v":7.333333333333333}]
[null,null,null,"W2",{"$f":"MIN(E40:E48)/3+E49","v":14.666666666666666},null,null,"Number of Point Loads:",{"$f":"SUM(F40:F48)","v":6}]
[null,null,null,"W3",{"$f":"(C21-MAX(E40:E48))/4+MAX(E40:E48)","v":141.5},null,null,"No. of Point Loads w/ Wire Segments:",{"$f":"I50+5","v":11}]
[null,null,null,"W4",{"$f":"(C21-MAX(E40:E48))/4+E51","v":152}]
[null,null,null,"W5",{"$f":"(C21-MAX(E40:E48))/4+E52","v":162.5}]
[null,null,null,"W6",{"$f":"C21","v":173}]
[]
[]
["Rank ID's and Wire Segments from right to left ( Support 2 to Support 1) and calculate loading:"]
[]
[null,null,"Original Rank With Wire","Re-rank","Final Rank","Loading ID","Distance"]
[null,null,{"$f":"IF(E40<>\"N/A\",RANK(E40,$E$40:$E$54,1),\"Exclude\")","v":3},{"$f":"IF(ISNUMBER(C60)=TRUE,C60,MAX($C$60:$C$74)+1)","v":3},{"$f":"RANK(D60,$D$60:$D$74,1)","v":3},{"$f":"D40","v":"Y"},{"$f":"E40","v":22}]
[null,null,4,{"$f":"IF(ISNUMBER(C61)=TRUE,C61,MAX($C$60:$C$74)+2)","v":4},4,"P",51]
[null,null,5,{"$f":"IF(ISNUMBER(C62)=TRUE,C62,MAX($C$60:$C$74)+3)","v":5},5,"O",68]
[null,null,6,{"$f":"IF(ISNUMBER(C63)=TRUE,C63,MAX($C$60:$C$74)+4)","v":6},6,"R",79]
[null,null,7,{"$f":"IF(ISNUMBER(C64)=TRUE,C64,MAX($C$60:$C$74)+5)","v":7},7,"N",89]
[null,null,8,{"$f":"IF(ISNUMBER(C65)=TRUE,C65,MAX($C$60:$C$74)+6)","v":8},8,"M",131]
[null,null,"Exclude",{"$f":"IF(ISNUMBER(C66)=TRUE,C66,MAX($C$60:$C$74)+7)","v":19},13,"S","N/A"]
[null,null,"Exclude",{"$f":"IF(ISNUMBER(C67)=TRUE,C67,MAX($C$60:$C$74)+8)","v":20},14,"T","N/A"]
[null,null,"Exclude",{"$f":"IF(ISNUMBER(C68)=TRUE,C68,MAX($C$60:$C$74)+9)","v":21},15,"U","N/A"]
[null,null,1,{"$f":"IF(ISNUMBER(C69)=TRUE,C69,MAX($C$60:$C$74)+10)","v":1},1,"W1",7.333333333333333]
[null,null,2,{"$f":"IF(ISNUMBER(C70)=TRUE,C70,MAX($C$60:$C$74)+11)","v":2},2,"W2",14.666666666666666]
[null,null,9,{"$f":"IF(ISNUMBER(C71)=TRUE,C71,MAX($C$60:$C$74)+12)","v":9},9,"W3",141.5]
[null,null,10,{"$f":"IF(ISNUMBER(C72)=TRUE,C72,MAX($C$60:$C$74)+13)","v":10},10,"W4",152]
[null,null,11,{"$f":"IF(ISNUMBER(C73)=TRUE,C73,MAX($C$60:$C$74)+14)","v":11},11,"W5",162.5]
[null,null,12,{"$f":"IF(ISNUMBER(C74)=TRUE,C74,MAX($C$60:$C$74)+15)","v":12},12,"W6",173]
[]
[null,"Final Rank","Loading ID","Distance","Distance for Table","Load description","Signal Config/Sign Size/Wire Dia"]
[null,1,{"$f":"VLOOKUP(B77,$E$60:$G$74,2,0)","v":"W1"},{"$f":"VLOOKUP(B77,$E$60:$G$74,3,0)","v":7.333333333333333},{"$f":"IF(ISNUMBER(D77),D77,0)","v":7.333333333333333},{"$f":"IF(OR(C77=$D$49,C77=$D$50,C77=$D$51,C77=$D$52,C77=$D$53,C77=$D$54),\"Wire\",VLOOKUP(C77,Input!$B$61:$C$69,2,0))","v":"Wire"},{"$f":"IF(F77=\"Signal\",VLOOKUP(C77,Input!$B$61:$F$69,4,0),IF(F77=\"Sign\",VLOOKUP(C77,Input!$B$61:$F$69,3,0),SW1_Wire_Dia))","v":"0.5\""}]
[null,2,"W2",14.666666666666666,14.666666666666666,{"$f":"IF(OR(C78=$D$49,C78=$D$50,C78=$D$51,C78=$D$52,C78=$D$53,C78=$D$54),\"Wire\",VLOOKUP(C78,Input!$B$61:$C$69,2,0))","v":"Wire"},{"$f":"IF(F78=\"Signal\",VLOOKUP(C78,Input!$B$61:$F$69,4,0),IF(F78=\"Sign\",VLOOKUP(C78,Input!$B$61:$F$69,3,0),SW1_Wire_Dia))","v":"0.5\""}]
[null,3,"Y",22,22,{"$f":"IF(OR(C79=$D$49,C79=$D$50,C79=$D$51,C79=$D$52,C79=$D$53,C79=$D$54),\"Wire\",VLOOKUP(C79,Input!$B$61:$C$69,2,0))","v":"Sign"},{"$f":"IF(F79=\"Signal\",VLOOKUP(C79,Input!$B$61:$F$69,4,0),IF(F79=\"Sign\",VLOOKUP(C79,Input!$B$61:$F$69,3,0),SW1_Wire_Dia))","v":"96\" x 32\""}]
[null,4,"P",51,51,{"$f":"IF(OR(C80=$D$49,C80=$D$50,C80=$D$51,C80=$D$52,C80=$D$53,C80=$D$54),\"Wire\",VLOOKUP(C80,Input!$B$61:$C$69,2,0))","v":"Signal"},{"$f":"IF(F80=\"Signal\",VLOOKUP(C80,Input!$B$61:$F$69,4,0),IF(F80=\"Sign\",VLOOKUP(C80,Input!$B$61:$F$69,3,0),SW1_Wire_Dia))","v":"A-3"}]
[null,5,"O",68,68,{"$f":"IF(OR(C81=$D$49,C81=$D$50,C81=$D$51,C81=$D$52,C81=$D$53,C81=$D$54),\"Wire\",VLOOKUP(C81,Input!$B$61:$C$69,2,0))","v":"Signal"},{"$f":"IF(F81=\"Signal\",VLOOKUP(C81,Input!$B$61:$F$69,4,0),IF(F81=\"Sign\",VLOOKUP(C81,Input!$B$61:$F$69,3,0),SW1_Wire_Dia))","v":"A-3"}]
[null,6,"R",79,79,{"$f":"IF(OR(C82=$D$49,C82=$D$50,C82=$D$51,C82=$D$52,C82=$D$53,C82=$D$54),\"Wire\",VLOOKUP(C82,Input!$B$61:$C$69,2,0))","v":"Sign"},{"$f":"IF(F82=\"Signal\",VLOOKUP(C82,Input!$B$61:$F$69,4,0),IF(F82=\"Sign\",VLOOKUP(C82,Input!$B$61:$F$69,3,0),SW1_Wire_Dia))","v":"30\" x 36\""}]
[null,7,"N",89,89,{"$f":"IF(OR(C83=$D$49,C83=$D$50,C83=$D$51,C83=$D$52,C83=$D$53,C83=$D$54),\"Wire\",VLOOKUP(C83,Input!$B$61:$C$69,2,0))","v":"Signal"},{"$f":"IF(F83=\"Signal\",VLOOKUP(C83,Input!$B$61:$F$69,4,0),IF(F83=\"Sign\",VLOOKUP(C83,Input!$B$61:$F$69,3,0),SW1_Wire_Dia))","v":"A-3"}]
[null,8,"M",131,131,{"$f":"IF(OR(C84=$D$49,C84=$D$50,C84=$D$51,C84=$D$52,C84=$D$53,C84=$D$54),\"Wire\",VLOOKUP(C84,Input!$B$61:$C$69,2,0))","v":"Signal"},{"$f":"IF(F84=\"Signal\",VLOOKUP(C84,Input!$B$61:$F$69,4,0),IF(F84=\"Sign\",VLOOKUP(C84,Input!$B$61:$F$69,3,0),SW1_Wire_Dia))","v":"A-3"}]
[null,9,"W3",141.5,141.5,{"$f":"IF(OR(C85=$D$49,C85=$D$50,C85=$D$51,C85=$D$52,C85=$D$53,C85=$D$54),\"Wire\",VLOOKUP(C85,Input!$B$61:$C$69,2,0))","v":"Wire"},{"$f":"IF(F85=\"Signal\",VLOOKUP(C85,Input!$B$61:$F$69,4,0),IF(F85=\"Sign\",VLOOKUP(C85,Input!$B$61:$F$69,3,0),SW1_Wire_Dia))","v":"0.5\""}]
[null,10,"W4",152,152,{"$f":"IF(OR(C86=$D$49,C86=$D$50,C86=$D$51,C86=$D$52,C86=$D$53,C86=$D$54),\"Wire\",VLOOKUP(C86,Input!$B$61:$C$69,2,0))","v":"Wire"},{"$f":"IF(F86=\"Signal\",VLOOKUP(C86,Input!$B$61:$F$69,4,0),IF(F86=\"Sign\",VLOOKUP(C86,Input!$B$61:$F$69,3,0),SW1_Wire_Dia))","v":"0.5\""}]
[null,11,"W5",162.5,162.5,{"$f":"IF(OR(C87=$D$49,C87=$D$50,C87=$D$51,C87=$D$52,C87=$D$53,C87=$D$54),\"Wire\",VLOOKUP(C87,Input!$B$61:$C$69,2,0))","v":"Wire"},{"$f":"IF(F87=\"Signal\",VLOOKUP(C87,Input!$B$61:$F$69,4,0),IF(F87=\"Sign\",VLOOKUP(C87,Input!$B$61:$F$69,3,0),SW1_Wire_Dia))","v":"0.5\""}]
[null,12,"W6",173,173,{"$f":"IF(OR(C88=$D$49,C88=$D$50,C88=$D$51,C88=$D$52,C88=$D$53,C88=$D$54),\"Wire\",VLOOKUP(C88,Input!$B$61:$C$69,2,0))","v":"Wire"},{"$f":"IF(F88=\"Signal\",VLOOKUP(C88,Input!$B$61:$F$69,4,0),IF(F88=\"Sign\",VLOOKUP(C88,Input!$B$61:$F$69,3,0),SW1_Wire_Dia))","v":"0.5\""}]
[null,13,"S","N/A",0,{"$f":"IF(OR(C89=$D$49,C89=$D$50,C89=$D$51,C89=$D$52,C89=$D$53,C89=$D$54),\"Wire\",VLOOKUP(C89,Input!$B$61:$C$69,2,0))","v":"Sign"},{"$f":"IF(F89=\"Signal\",VLOOKUP(C89,Input!$B$61:$F$69,4,0),IF(F89=\"Sign\",VLOOKUP(C89,Input!$B$61:$F$69,3,0),SW1_Wire_Dia))","v":"None"}]
[null,14,"T","N/A",0,{"$f":"IF(OR(C90=$D$49,C90=$D$50,C90=$D$51,C90=$D$52,C90=$D$53,C90=$D$54),\"Wire\",VLOOKUP(C90,Input!$B$61:$C$69,2,0))","v":"Sign"},{"$f":"IF(F90=\"Signal\",VLOOKUP(C90,Input!$B$61:$F$69,4,0),IF(F90=\"Sign\",VLOOKUP(C90,Input!$B$61:$F$69,3,0),SW1_Wire_Dia))","v":"None"}]
[null,15,"U","N/A",0,{"$f":"IF(OR(C91=$D$49,C91=$D$50,C91=$D$51,C91=$D$52,C91=$D$53,C91=$D$54),\"Wire\",VLOOKUP(C91,Input!$B$61:$C$69,2,0))","v":"Sign"},{"$f":"IF(F91=\"Signal\",VLOOKUP(C91,Input!$B$61:$F$69,4,0),IF(F91=\"Sign\",VLOOKUP(C91,Input!$B$61:$F$69,3,0),SW1_Wire_Dia))","v":"None"}]
[]
["Calculate Loads:"]
[]
[null,"Wire Weights:"]
[null,null,"Wire Weight =",{"$f":"VLOOKUP(SW1_Wire_Dia,'Pick Lists & Data'!A29:B33,2,0)","v":1},"lb/ft"]
[null,null,"Wire Wind Load =",{"$f":"VLOOKUP(SW1_Wire_Dia,'Pick Lists & Data'!A29:L33,10,0)","v":1.2690773333333334},"lb/ft"]
[null,null,"Wire Ice Load =",{"$f":"VLOOKUP(SW1_Wire_Dia,'Pick Lists & Data'!A29:L33,12,0)","v":0.4},"lb/ft"]
[]
["Loading Final Rank","Distance for Table","Signal Config/Sign Size/Wire Dia","Wire Segment Dead Load","Signal/Sign Dead Load","Wire Segment Wind Load","Signal/Sign Wind Load","Wire Segment Ice Load","Signal/Sign Ice Load"]
[{"$f":"B77","v":1},{"$f":"E77","v":7.333333333333333},{"$f":"G77","v":"0.5\""},{"$f":"$D$77+($D$78-$D$77)*0.5*$D$96","v":11},{"$f":"IF($F77=\"Wire\",0,IF($F77=\"Sign\",VLOOKUP($G77,'Pick Lists & Data'!$A$39:$G$43,2,0),VLOOKUP($G77,'Pick Lists & Data'!$A$11:$H$25,2,0)))","v":0},{"$f":"$D$77+($D$78-$D$77)*0.5*$D$97","v":11.986616888888889},{"$f":"IF($F77=\"Wire\",0,IF($F77=\"Sign\",VLOOKUP($G77,'Pick Lists & Data'!$A$39:$G$43,6,0),VLOOKUP($G77,'Pick Lists & Data'!$A$11:$H$25,6,0)))","v":0},{"$f":"$D$77+($D$78-$D$77)*0.5*$D$98","v":8.8000000000000007},{"$f":"IF($F77=\"Wire\",0,IF($F77=\"Sign\",VLOOKUP($G77,'Pick Lists & Data'!$A$39:$G$43,7,0),VLOOKUP($G77,'Pick Lists & Data'!$A$11:$H$25,8,0)))","v":0}]
[2,14.666666666666666,"0.5\"",{"$f":"IF($E79=0,0,IF($E78<$C$21,(($E78-$E77)*0.5+($E79-$E78)*0.5)*$D$96,(($E78-$E77)*0.5+($E79-E$78))*$D$96))","v":7.3333333333333339},{"$f":"IF(F78=\"Wire\",0,IF(F78=\"Sign\",VLOOKUP(G78,'Pick Lists & Data'!$A$39:$G$43,2,0),VLOOKUP(G78,'Pick Lists & Data'!$A$11:$H$25,2,0)))","v":0},{"$f":"IF($E79=0,0,IF($E78<$C$21,(($E78-$E77)*0.5+($E79-$E78)*0.5)*$D$97,(($E78-$E77)*0.5+($E79-G$78))*$D$97))","v":9.3065671111111126},{"$f":"IF($F78=\"Wire\",0,IF($F78=\"Sign\",VLOOKUP($G78,'Pick Lists & Data'!$A$39:$G$43,6,0),VLOOKUP($G78,'Pick Lists & Data'!$A$11:$H$25,6,0)))","v":0},{"$f":"IF($E79=0,0,IF($E78<$C$21,(($E78-$E77)*0.5+($E79-$E78)*0.5)*$D$98,(($E78-$E77)*0.5+($E79-E$102))*$D$98))","v":2.9333333333333336},{"$f":"IF($F78=\"Wire\",0,IF($F78=\"Sign\",VLOOKUP($G78,'Pick Lists & Data'!$A$39:$G$43,7,0),VLOOKUP($G78,'Pick Lists & Data'!$A$11:$H$25,8,0)))","v":0}]
[3,22,"96\" x 32\"",18.166666666666668,{"$f":"IF(F79=\"Wire\",0,IF(F79=\"Sign\",VLOOKUP(G79,'Pick Lists & Data'!$A$39:$G$43,2,0),VLOOKUP(G79,'Pick Lists & Data'!$A$11:$H$25,2,0)))","v":106},23.054904888888892,{"$f":"IF($F79=\"Wire\",0,IF($F79=\"Sign\",VLOOKUP($G79,'Pick Lists & Data'!$A$39:$G$43,6,0),VLOOKUP($G79,'Pick Lists & Data'!$A$11:$H$25,6,0)))","v":708.72662015999992},7.2666666666666675,{"$f":"IF($F79=\"Wire\",0,IF($F79=\"Sign\",VLOOKUP($G79,'Pick Lists & Data'!$A$39:$G$43,7,0),VLOOKUP($G79,'Pick Lists & Data'!$A$11:$H$25,8,0)))","v":63.989999999999995}]
[4,51,"A-3",23,{"$f":"IF(F80=\"Wire\",0,IF(F80=\"Sign\",VLOOKUP(G80,'Pick Lists & Data'!$A$39:$G$43,2,0),VLOOKUP(G80,'Pick Lists & Data'!$A$11:$H$25,2,0)))","v":70},29.188778666666668,{"$f":"IF($F80=\"Wire\",0,IF($F80=\"Sign\",VLOOKUP($G80,'Pick Lists & Data'!$A$39:$G$43,6,0),VLOOKUP($G80,'Pick Lists & Data'!$A$11:$H$25,6,0)))","v":291.06634751999997},9.2000000000000011,{"$f":"IF($F80=\"Wire\",0,IF($F80=\"Sign\",VLOOKUP($G80,'Pick Lists & Data'!$A$39:$G$43,7,0),VLOOKUP($G80,'Pick Lists & Data'!$A$11:$H$25,8,0)))","v":58.56}]
[5,68,"A-3",14,{"$f":"IF(F81=\"Wire\",0,IF(F81=\"Sign\",VLOOKUP(G81,'Pick Lists & Data'!$A$39:$G$43,2,0),VLOOKUP(G81,'Pick Lists & Data'!$A$11:$H$25,2,0)))","v":70},17.767082666666667,{"$f":"IF($F81=\"Wire\",0,IF($F81=\"Sign\",VLOOKUP($G81,'Pick Lists & Data'!$A$39:$G$43,6,0),VLOOKUP($G81,'Pick Lists & Data'!$A$11:$H$25,6,0)))","v":291.06634751999997},5.6000000000000005,{"$f":"IF($F81=\"Wire\",0,IF($F81=\"Sign\",VLOOKUP($G81,'Pick Lists & Data'!$A$39:$G$43,7,0),VLOOKUP($G81,'Pick Lists & Data'!$A$11:$H$25,8,0)))","v":58.56}]
[6,79,"30\" x 36\"",10.5,{"$f":"IF(F82=\"Wire\",0,IF(F82=\"Sign\",VLOOKUP(G82,'Pick Lists & Data'!$A$39:$G$43,2,0),VLOOKUP(G82,'Pick Lists & Data'!$A$11:$H$25,2,0)))","v":39},13.325312,{"$f":"IF($F82=\"Wire\",0,IF($F82=\"Sign\",VLOOKUP($G82,'Pick Lists & Data'!$A$39:$G$43,6,0),VLOOKUP($G82,'Pick Lists & Data'!$A$11:$H$25,6,0)))","v":247.12396799999999},4.2,{"$f":"IF($F82=\"Wire\",0,IF($F82=\"Sign\",VLOOKUP($G82,'Pick Lists & Data'!$A$39:$G$43,7,0),VLOOKUP($G82,'Pick Lists & Data'!$A$11:$H$25,8,0)))","v":22.5}]
[7,89,"A-3",26,{"$f":"IF(F83=\"Wire\",0,IF(F83=\"Sign\",VLOOKUP(G83,'Pick Lists & Data'!$A$39:$G$43,2,0),VLOOKUP(G83,'Pick Lists & Data'!$A$11:$H$25,2,0)))","v":70},32.99601066666667,{"$f":"IF($F83=\"Wire\",0,IF($F83=\"Sign\",VLOOKUP($G83,'Pick Lists & Data'!$A$39:$G$43,6,0),VLOOKUP($G83,'Pick Lists & Data'!$A$11:$H$25,6,0)))","v":291.06634751999997},10.4,{"$f":"IF($F83=\"Wire\",0,IF($F83=\"Sign\",VLOOKUP($G83,'Pick Lists & Data'!$A$39:$G$43,7,0),VLOOKUP($G83,'Pick Lists & Data'!$A$11:$H$25,8,0)))","v":58.56}]
[8,131,"A-3",26.25,{"$f":"IF(F84=\"Wire\",0,IF(F84=\"Sign\",VLOOKUP(G84,'Pick Lists & Data'!$A$39:$G$43,2,0),VLOOKUP(G84,'Pick Lists & Data'!$A$11:$H$25,2,0)))","v":70},33.313279999999999,{"$f":"IF($F84=\"Wire\",0,IF($F84=\"Sign\",VLOOKUP($G84,'Pick Lists & Data'!$A$39:$G$43,6,0),VLOOKUP($G84,'Pick Lists & Data'!$A$11:$H$25,6,0)))","v":291.06634751999997},10.5,{"$f":"IF($F84=\"Wire\",0,IF($F84=\"Sign\",VLOOKUP($G84,'Pick Lists & Data'!$A$39:$G$43,7,0),VLOOKUP($G84,'Pick Lists & Data'!$A$11:$H$25,8,0)))","v":58.56}]
[9,141.5,"0.5\"",10.5,{"$f":"IF(F85=\"Wire\",0,IF(F85=\"Sign\",VLOOKUP(G85,'Pick Lists & Data'!$A$39:$G$43,2,0),VLOOKUP(G85,'Pick Lists & Data'!$A$11:$H$25,2,0)))","v":0},13.325312,{"$f":"IF($F85=\"Wire\",0,IF($F85=\"Sign\",VLOOKUP($G85,'Pick Lists & Data'!$A$39:$G$43,6,0),VLOOKUP($G85,'Pick Lists & Data'!$A$11:$H$25,6,0)))","v":0},4.2,{"$f":"IF($F85=\"Wire\",0,IF($F85=\"Sign\",VLOOKUP($G85,'Pick Lists & Data'!$A$39:$G$43,7,0),VLOOKUP($G85,'Pick Lists & Data'!$A$11:$H$25,8,0)))","v":0}]
[10,152,"0.5\"",10.5,{"$f":"IF(F86=\"Wire\",0,IF(F86=\"Sign\",VLOOKUP(G86,'Pick Lists & Data'!$A$39:$G$43,2,0),VLOOKUP(G86,'Pick Lists & Data'!$A$11:$H$25,2,0)))","v":0},13.325312,{"$f":"IF($F86=\"Wire\",0,IF($F86=\"Sign\",VLOOKUP($G86,'Pick Lists & Data'!$A$39:$G$43,6,0),VLOOKUP($G86,'Pick Lists & Data'!$A$11:$H$25,6,0)))","v":0},4.2,{"$f":"IF($F86=\"Wire\",0,IF($F86=\"Sign\",VLOOKUP($G86,'Pick Lists & Data'!$A$39:$G$43,7,0),VLOOKUP($G86,'Pick Lists & Data'!$A$11:$H$25,8,0)))","v":0}]
[11,162.5,"0.5\"",10.5,{"$f":"IF(F87=\"Wire\",0,IF(F87=\"Sign\",VLOOKUP(G87,'Pick Lists & Data'!$A$39:$G$43,2,0),VLOOKUP(G87,'Pick Lists & Data'!$A$11:$H$25,2,0)))","v":0},13.325312,{"$f":"IF($F87=\"Wire\",0,IF($F87=\"Sign\",VLOOKUP($G87,'Pick Lists & Data'!$A$39:$G$43,6,0),VLOOKUP($G87,'Pick Lists & Data'!$A$11:$H$25,6,0)))","v":0},4.2,{"$f":"IF($F87=\"Wire\",0,IF($F87=\"Sign\",VLOOKUP($G87,'Pick Lists & Data'!$A$39:$G$43,7,0),VLOOKUP($G87,'Pick Lists & Data'!$A$11:$H$25,8,0)))","v":0}]
[12,173,"0.5\"",0,{"$f":"IF(F88=\"Wire\",0,IF(F88=\"Sign\",VLOOKUP(G88,'Pick Lists & Data'!$A$39:$G$43,2,0),VLOOKUP(G88,'Pick Lists & Data'!$A$11:$H$25,2,0)))","v":0},0,{"$f":"IF($F88=\"Wire\",0,IF($F88=\"Sign\",VLOOKUP($G88,'Pick Lists & Data'!$A$39:$G$43,6,0),VLOOKUP($G88,'Pick Lists & Data'!$A$11:$H$25,6,0)))","v":0},0,{"$f":"IF($F88=\"Wire\",0,IF($F88=\"Sign\",VLOOKUP($G88,'Pick Lists & Data'!$A$39:$G$43,7,0),VLOOKUP($G88,'Pick Lists & Data'!$A$11:$H$25,8,0)))","v":0}]
[13,0,"None",0,{"$f":"IF(F89=\"Wire\",0,IF(F89=\"Sign\",VLOOKUP(G89,'Pick Lists & Data'!$A$39:$G$43,2,0),VLOOKUP(G89,'Pick Lists & Data'!$A$11:$H$25,2,0)))","v":0},0,{"$f":"IF($F89=\"Wire\",0,IF($F89=\"Sign\",VLOOKUP($G89,'Pick Lists & Data'!$A$39:$G$43,6,0),VLOOKUP($G89,'Pick Lists & Data'!$A$11:$H$25,6,0)))","v":0},0,{"$f":"IF($F89=\"Wire\",0,IF($F89=\"Sign\",VLOOKUP($G89,'Pick Lists & Data'!$A$39:$G$43,7,0),VLOOKUP($G89,'Pick Lists & Data'!$A$11:$H$25,8,0)))","v":0}]
[14,0,"None",0,{"$f":"IF(F90=\"Wire\",0,IF(F90=\"Sign\",VLOOKUP(G90,'Pick Lists & Data'!$A$39:$G$43,2,0),VLOOKUP(G90,'Pick Lists & Data'!$A$11:$H$25,2,0)))","v":0},0,{"$f":"IF($F90=\"Wire\",0,IF($F90=\"Sign\",VLOOKUP($G90,'Pick Lists & Data'!$A$39:$G$43,6,0),VLOOKUP($G90,'Pick Lists & Data'!$A$11:$H$25,6,0)))","v":0},0,{"$f":"IF($F90=\"Wire\",0,IF($F90=\"Sign\",VLOOKUP($G90,'Pick Lists & Data'!$A$39:$G$43,7,0),VLOOKUP($G90,'Pick Lists & Data'!$A$11:$H$25,8,0)))","v":0}]
[15,0,"None",{"$f":"IF($T162=0,0,IF($E91<$C$21,(($E91-$E90)*0.5+($T162-$E91)*0.5)*$D$96,(($E91-$E90)*0.5+($T162-E$78))*$D$96))","v":0},{"$f":"IF(F91=\"Wire\",0,IF(F91=\"Sign\",VLOOKUP(G91,'Pick Lists & Data'!$A$39:$G$43,2,0),VLOOKUP(G91,'Pick Lists & Data'!$A$11:$H$25,2,0)))","v":0},{"$f":"IF($T162=0,0,IF($E91<$C$21,(($E91-$E90)*0.5+($T162-$E91)*0.5)*$D$97,(($E91-$E90)*0.5+($T162-G$78))*$D$97))","v":0},{"$f":"IF($F91=\"Wire\",0,IF($F91=\"Sign\",VLOOKUP($G91,'Pick Lists & Data'!$A$39:$G$43,6,0),VLOOKUP($G91,'Pick Lists & Data'!$A$11:$H$25,6,0)))","v":0},{"$f":"IF($T162=0,0,IF($E91<$C$21,(($E91-$E90)*0.5+($T162-$E91)*0.5)*$D$98,(($E91-$E90)*0.5+($T162-E$102))*$D$98))","v":0},{"$f":"IF($F91=\"Wire\",0,IF($F91=\"Sign\",VLOOKUP($G91,'Pick Lists & Data'!$A$39:$G$43,7,0),VLOOKUP($G91,'Pick Lists & Data'!$A$11:$H$25,8,0)))","v":0}]
[]
["Place Distances and Loads into table for span wire analysis"]
[]
[null,"Loading Final Rank","Distance (Xn)","Dead Load","Wind Load","Ice Load","Load Description","Signal Config/Sign Size/Wire Diameter"]
[null,1,{"$f":"B101","v":7.333333333333333},{"$f":"SUM(D101:E101)","v":11},{"$f":"SUM(F101:G101)","v":11.986616888888889},{"$f":"SUM(H101:I101)","v":8.8000000000000007},{"$f":"F77","v":"Wire"},{"$f":"C101","v":"0.5\""}]
[null,2,{"$f":"B102","v":14.666666666666666},{"$f":"SUM(D102:E102)","v":7.3333333333333339},{"$f":"SUM(F102:G102)","v":9.3065671111111126},{"$f":"SUM(H102:I102)","v":2.9333333333333336},"Wire",{"$f":"C102","v":"0.5\""}]
[null,3,22,124.16666666666667,731.78152504888885,71.256666666666661,"Sign","96\" x 32\""]
[null,4,51,93,320.25512618666664,67.760000000000005,"Signal","A-3"]
[null,5,68,84,308.83343018666665,64.16,"Signal","A-3"]
[null,6,79,49.5,260.44927999999999,26.7,"Sign","30\" x 36\""]
[null,7,89,96,324.06235818666664,68.960000000000008,"Signal","A-3"]
[null,8,131,96.25,324.37962751999999,69.06,"Signal","A-3"]
[null,9,141.5,10.5,13.325312,4.2,"Wire","0.5\""]
[null,10,152,10.5,13.325312,4.2,"Wire","0.5\""]
[null,11,162.5,10.5,13.325312,4.2,"Wire","0.5\""]
[null,12,173,0,0,0,"Wire","0.5\""]
[null,13,0,0,0,0,"Sign","None"]
[null,14,0,0,0,0,"Sign","None"]
[null,15,0,0,0,0,"Sign","None"]
[null,null,null,{"$f":"SUM(D120:D134)","v":592.75},{"$f":"SUM(E120:E134)","v":2331.0304671288886}]
[]
[null,"* Distances MUST be entered in order, starting with the load closest to Support 1 and moving"]
[null,"right towards Support 2.  If all 14 loads are not used, a \"null distance\" and a \"null load\" must be "]
[null,"assigned to the worksheet cell (ie. Enter a zero for each null value.)"]
[]
["Dead Load (Group I Loading, also used for Groups II and III)"]
[]
["Calculate Dead Load Reactions:"]
[null,"Summing moments about Support 2 (Counter clockwise-moments positive):"]
[]
[null,"Loading","Dead Load","Arm","Moment"]
[null,{"$f":"B120","v":1},{"$f":"D120","v":11},{"$f":"C120","v":7.333333333333333},{"$f":"C147*D147","v":80.666666666666657}]
[null,2,7.3333333333333339,14.666666666666666,107.55555555555556]
[null,3,124.16666666666667,22,2731.666666666667]
[null,4,93,51,4743]
[null,5,84,68,5712]
[null,6,49.5,79,3910.5]
[null,7,96,89,8544]
[null,8,96.25,131,12608.75]
[null,9,10.5,141.5,1485.75]
[null,10,10.5,152,1596]
[null,11,10.5,162.5,1706.25]
[null,12,0,173,0]
[null,13,0,0,0]
[null,14,0,0,0]
[null,15,0,0,0]
[]
[null,"S MomentsSupport 2 = 0 = [(S Loadn * Xn)] - (R Support 1 * Length)"]
[null,"R Support 1 =",{"$f":"(SUM(E147:E161)/C21)","v":249.86207450224794},"lbs"]
[]
[null,"S Forcey = 0 = R Support 2 + R Support 1 - (S Loadn)"]
[null,"R Support 2 =",{"$f":"(SUM(C147:C161))-C164","v":342.88792549775206},"lbs"]
[]
["Dead Load Shear Diagram:"]
[null,"Location","Distance","Load / Reaction","Shear 1","Shear 2"]
[null,"Support 2",0,{"$f":"C167","v":342.88792549775206},{"$f":"0","v":0},{"$f":"E171+C167","v":342.88792549775206},{"$f":"IF(AND(E171>=0,F171>=0),\"+ / +\",IF(AND(E171<=0,F171<=0),\"- / -\",\"+ / -\"))","v":"+ / +"},{"$f":"IF(G171=\"+ / -\",\"Low Point\",\"\")","v":""},{"$f":"IF(H171=\"Low Point\",C171,\" \")","v":" "}]
[null,{"$f":"B120","v":1},7.333333333333333,11,{"$f":"IF(D172>0,F171,\" \")","v":342.88792549775206},{"$f":"IF(D171>0,E172-D172,\" \")","v":331.88792549775206},{"$f":"IF(AND(E172>=0,F172>=0),\"+ / +\",IF(AND(E172<=0,F172<=0),\"- / -\",\"+ / -\"))","v":"+ / +"},{"$f":"IF(G172=\"+ / -\",\"Low Point\",\"\")","v":""},{"$f":"IF(H172=\"Low Point\",C172,\" \")","v":" "}]
[null,2,14.666666666666666,7.3333333333333339,{"$f":"F172","v":331.88792549775206},{"$f":"E173-D173","v":324.55459216441875},"+ / +",""," "]
[null,3,22,124.16666666666667,{"$f":"F173","v":324.55459216441875},{"$f":"E174-D174","v":200.38792549775206},{"$f":"IF(AND(E174>=0,F174>=0),\"+ / +\",IF(AND(E174<=0,F174<=0),\"- / -\",\"+ / -\"))","v":"+ / +"},{"$f":"IF(G174=\"+ / -\",\"Low Point\",\"\")","v":""},{"$f":"IF(H174=\"Low Point\",C174,\" \")","v":" "}]
[null,4,51,93,{"$f":"F174","v":200.38792549775206},{"$f":"E175-D175","v":107.38792549775206},"+ / +",{"$f":"IF(G175=\"+ / -\",\"Low Point\",\"\")","v":""}," "]
[null,5,68,84,{"$f":"F175","v":107.38792549775206},23.387925497752065,"+ / +",""," "]
[null,6,79,49.5,23.387925497752065,-26.112074502247935,"+ / -","Low Point",79]
[null,7,89,96,-26.112074502247935,-122.11207450224794,"- / -",""," "]
[null,8,131,96.25,-122.11207450224794,-218.36207450224794,{"$f":"IF(AND(E179>=0,F179>=0),\"+ / +\",IF(AND(E179<=0,F179<=0),\"- / -\",\"+ / -\"))","v":"- / -"},"",{"$f":"IF(H179=\"Low Point\",C179,\" \")","v":" "}]
[null,9,141.5,10.5,-218.36207450224794,-228.86207450224794,"- / -",""," "]
[null,10,152,10.5,-228.86207450224794,-239.36207450224794,"- / -",""," "]
[null,11,162.5,10.5,-239.36207450224794,-249.86207450224794,"- / -",""," "]
[null,12,173,0,-249.86207450224794,-249.86207450224794,"- / -",""," "]
[null,13,0,0,-249.86207450224794,-249.86207450224794,"- / -",""," "]
[null,14,0,0,-249.86207450224794,-249.86207450224794,"- / -",""," "]
[null,15,0,0,{"$f":"F185","v":-249.86207450224794},{"$f":"E186-D186","v":-249.86207450224794},{"$f":"IF(AND(E186>=0,F186>=0),\"+ / +\",IF(AND(E186<=0,F186<=0),\"- / -\",\"+ / -\"))","v":"- / -"},{"$f":"IF(G186=\"+ / -\",\"Low Point\",\"\")","v":""},{"$f":"IF(H186=\"Low Point\",C186,\" \")","v":" "}]
[null,"Support 1",{"$f":"C21","v":173},{"$f":"C164","v":249.86207450224794},{"$f":"F186","v":-249.86207450224794},{"$f":"E187+D187","v":0},"- / -",""," "]
[]
[null,"The Low Point occurs at:",null,{"$f":"MAX(I171:I187)","v":79},"feet from Support 2"]
["Calculation: Sum Moments about Low Point to Determine Horizontal Reaction:"]
[]
[null,"Maximum Allowable Sag:",null,{"$f":"(G21/100)*C21","v":8.65},"feet"]
[null,"Summing Moments about the Low point (Counter-Clockwise Positive):"]
[]
[null,"Location","Distance from Low Point","Load","Moment"]
[null,"Support 2",{"$f":"D189","v":79},{"$f":"D171","v":342.88792549775206},{"$f":"C196*D196","v":27088.146114322411}]
[null,{"$f":"B120","v":1},{"$f":"IF(C172=0,0,IF(C172<$D$189,($D$189-C172),0))","v":71.666666666666671},11,{"$f":"-C197*D197","v":-788.33333333333337}]
[null,2,64.333333333333329,7.3333333333333339,{"$f":"-C198*D198","v":-471.77777777777777}]
[null,3,57,124.16666666666667,{"$f":"-C199*D199","v":-7077.5}]
[null,4,28,93,{"$f":"-C200*D200","v":-2604}]
[null,5,11,84,{"$f":"-C201*D201","v":-924}]
[null,6,0,49.5,0]
[null,7,0,96,0]
[null,8,0,96.25,0]
[null,9,0,10.5,0]
[null,10,0,10.5,0]
[null,11,0,10.5,0]
[null,12,0,0,0]
[null,13,0,0,0]
[null,14,0,0,0]
[null,15,0,0,{"$f":"-C211*D211","v":0}]
[null,"Support 1",0,249.86207450224794,0]
[]
[null,"Determine Horizontal force:"]
[null,"H = ",{"$f":"ABS(SUM(E196:E212)/D192)","v":1759.830636209399},"lbs"]
[]
["Calculate Actual Length of Cable (Accounting for sag, Dead Load Only):"]
[null,"Fy = Shear 2, calculated above."]
[]
[null,"Location","Fy","xi","Length of Segment"]
[null,"Support 1"]
[null,{"$f":"B120","v":1},{"$f":"E172","v":342.88792549775206},{"$f":"IF(B222<($G$6+1),((C172-C171)),(IF(B222=($G$6+1),(($C$187-C171)),0)))","v":7.333333333333333},{"$f":"SQRT($C$215^2+C222^2)*(D222/$C$215)","v":7.4712350706679969}]
[null,2,{"$f":"E173","v":331.88792549775206},7.333333333333333,{"$f":"SQRT($C$215^2+C223^2)*(D223/$C$215)","v":7.4626044537361098}]
[null,3,324.55459216441875,7.3333333333333339,7.4570016956083665]
[null,4,200.38792549775206,29,29.187399487336791]
[null,5,107.38792549775206,17,17.031621637555336]
[null,6,23.387925497752065,11,11.00097137108158]
[null,7,-26.112074502247935,10,10.001100745977803]
[null,8,-122.11207450224794,42,42.100988739141776]
[null,9,-218.36207450224794,10.5,10.580521142873694]
[null,10,-228.86207450224794,10.5,10.588417964024446]
[null,11,-239.36207450224794,10.5,10.596679285007941]
[null,12,-249.86207450224794,10.5,10.605304254009868]
[null,13,-249.86207450224794,0,0]
[null,14,-249.86207450224794,0,0]
[null,15,-249.86207450224794,0,0]
[null,"Support 2",-249.86207450224794,0,0]
[]
[null,null,null,"Total Length =",{"$f":"SUM(E221:E237)","v":174.08384584702171}]
["Wind Loading"]
[]
["Calculate Reactions at each support:"]
[]
[null,"Summing moments about Support 2 (Clockwise moments positive):"]
[]
[null,"Loading","Wind Load","Arm","Moment"]
[null,{"$f":"B120","v":1},{"$f":"E120","v":11.986616888888889},{"$f":"C120","v":7.333333333333333},{"$f":"C247*D247","v":87.901857185185179}]
[null,2,9.3065671111111126,14.666666666666666,{"$f":"C248*D248","v":136.49631762962966}]
[null,3,731.78152504888885,22,16099.193551075554]
[null,4,320.25512618666664,51,16333.011435519998]
[null,5,308.83343018666665,68,21000.673252693334]
[null,6,260.44927999999999,79,20575.493119999999]
[null,7,324.06235818666664,89,28841.549878613332]
[null,8,324.37962751999999,131,{"$f":"C254*D254","v":42493.731205119999}]
[null,9,13.325312,141.5,1885.5316480000001]
[null,10,13.325312,152,2025.447424]
[null,11,13.325312,162.5,2165.3632000000002]
[null,12,0,173,0]
[null,13,0,0,0]
[null,14,0,0,0]
[null,15,0,0,{"$f":"C261*D261","v":0}]
[]
[null,"S MomentsSupport 2 = 0 = [(S Loadn * Xn)] - (R Support 1 * Length)"]
[null,"R Support 1 =",{"$f":"(SUM(E247:E261)/C21)","v":876.55718433431832},"lbs"]
[]
[null,"S Forcey = 0 = R Support 2 + R Support 1 - (S Loadn)"]
[null,"R Support 2 =",{"$f":"(SUM(C247:C261))-C264","v":1454.4732827945704},"lbs"]
[]
["Wind Load Shear Diagram:"]
[null,"Location","Distance","Load / Reaction","Shear 1","Shear 2"]
[null,"Support 2",0,{"$f":"C267","v":1454.4732827945704},{"$f":"0","v":0},{"$f":"E271+C267","v":1454.4732827945704}]
[null,{"$f":"B222","v":1},{"$f":"C120","v":7.333333333333333},{"$f":"E120","v":11.986616888888889},{"$f":"IF(D272>0,F271,\" \")","v":1454.4732827945704},{"$f":"IF(D271>0,E272-D272,\" \")","v":1442.4866659056815}]
[null,2,14.666666666666666,9.3065671111111126,{"$f":"F272","v":1442.4866659056815},{"$f":"E273-D273","v":1433.1800987945705}]
[null,3,22,731.78152504888885,1433.1800987945705,701.39857374568169]
[null,4,51,320.25512618666664,701.39857374568169,381.14344755901504]
[null,5,68,308.83343018666665,381.14344755901504,72.310017372348398]
[null,6,79,260.44927999999999,72.310017372348398,-188.13926262765159]
[null,7,89,324.06235818666664,-188.13926262765159,-512.20162081431818]
[null,8,131,324.37962751999999,{"$f":"F278","v":-512.20162081431818},{"$f":"E279-D279","v":-836.58124833431816}]
[null,9,141.5,13.325312,-836.58124833431816,-849.90656033431821]
[null,10,152,13.325312,-849.90656033431821,-863.23187233431827]
[null,11,162.5,13.325312,-863.23187233431827,-876.55718433431832]
[null,12,173,0,-876.55718433431832,-876.55718433431832]
[null,13,0,0,-876.55718433431832,-876.55718433431832]
[null,14,0,0,-876.55718433431832,-876.55718433431832]
[null,15,0,0,{"$f":"F285","v":-876.55718433431832},{"$f":"E286-D286","v":-876.55718433431832}]
[null,"Support 1",{"$f":"C21","v":173},{"$f":"C264","v":876.55718433431832},{"$f":"F286","v":-876.55718433431832},{"$f":"E287+D287","v":0}]
[]
[]
["Ice Load"]
[]
["Calculate Reactions at each support:"]
[]
[null,"Summing moments about Support 2 (Clockwise moments positive):"]
[]
[null,"Loading","Ice Load","Arm","Moment"]
[null,{"$f":"B120","v":1},{"$f":"F120","v":8.8000000000000007},{"$f":"C120","v":7.333333333333333},{"$f":"C297*D297","v":64.533333333333331}]
[null,2,2.9333333333333336,14.666666666666666,{"$f":"C298*D298","v":43.022222222222226}]
[null,3,71.256666666666661,22,1567.6466666666665]
[null,4,67.760000000000005,51,3455.76]
[null,5,64.16,68,4362.88]
[null,6,26.7,79,2109.2999999999997]
[null,7,68.960000000000008,89,6137.4400000000005]
[null,8,69.06,131,9046.86]
[null,9,4.2,141.5,594.30000000000007]
[null,10,4.2,152,638.4]
[null,11,4.2,162.5,682.5]
[null,12,0,173,0]
[null,13,0,0,0]
[null,14,0,0,0]
[null,15,0,0,0]
[]
[null,"S MomentsSupport 2 = 0 = [(S Loadn * Xn)] - (R Support 1 * Length)"]
[null,"R Support 1 =",{"$f":"(SUM(E297:E311)/C21)","v":165.91122671804752},"lbs"]
[]
[null,"S Forcey = 0 = R Support 2 + R Support 1 - (S Loadn)"]
[null,"R Support 2 =",{"$f":"(SUM(C297:C311))-C314","v":226.31877328195245},"lbs"]
[]
["Ice Load Shear Diagram:"]
[null,"Location","Distance","Load / Reaction","Shear 1","Shear 2"]
[null,"Support 2",{"$f":"0","v":0},{"$f":"C317","v":226.31877328195245},0,{"$f":"E321+C317","v":226.31877328195245}]
[null,{"$f":"B120","v":1},7.333333333333333,{"$f":"F120","v":8.8000000000000007},{"$f":"IF(D322>0,F321,\" \")","v":226.31877328195245},{"$f":"IF(D321>0,E322-D322,\" \")","v":217.51877328195243}]
[null,2,14.666666666666666,2.9333333333333336,{"$f":"F322","v":217.51877328195243},{"$f":"E323-D323","v":214.5854399486191}]
[null,3,22,71.256666666666661,214.5854399486191,143.32877328195244]
[null,4,51,67.760000000000005,143.32877328195244,75.568773281952431]
[null,5,68,64.16,75.568773281952431,11.408773281952435]
[null,6,79,26.7,11.408773281952435,-15.291226718047565]
[null,7,89,68.960000000000008,-15.291226718047565,-84.251226718047576]
[null,8,131,69.06,-84.251226718047576,-153.31122671804758]
[null,9,141.5,4.2,-153.31122671804758,-157.51122671804757]
[null,10,152,4.2,-157.51122671804757,-161.71122671804756]
[null,11,162.5,4.2,-161.71122671804756,-165.91122671804754]
[null,12,173,0,-165.91122671804754,-165.91122671804754]
[null,13,0,0,-165.91122671804754,-165.91122671804754]
[null,14,0,0,-165.91122671804754,-165.91122671804754]
[null,15,0,0,-165.91122671804754,-165.91122671804754]
[null,"Support 1",{"$f":"C21","v":173},{"$f":"C314","v":165.91122671804752},{"$f":"IF(D337>0,F336,\" \")","v":-165.91122671804754},{"$f":"E337+D337","v":0}]
[]
["Determine Fx - Group II (Dead + Wind)"]
[]
[null,"Value for Fx:",3804.8368981276994,null,"Fx2 =",{"$f":"C341*C341","v":14476783.821354013}]
[]
[null,"Location","Fyi","Fyi2","Fzi","Fzi2","xi","Vector Component"]
[null,{"$f":"B120","v":1},{"$f":"F171","v":342.88792549775206},{"$f":"C344*C344","v":117572.12945215197},{"$f":"F271","v":1454.4732827945704},{"$f":"E344*E344","v":2115492.5303632142},{"$f":"D222","v":7.333333333333333},{"$f":"(($F$341+D344+F344)^(0.5))*(G344/$C$341)","v":7.8786469080181716}]
[null,2,331.88792549775206,{"$f":"C345*C345","v":110149.59509120142},1442.4866659056815,{"$f":"E345*E345","v":2080767.7813156894},7.333333333333333,{"$f":"(($F$341+D345+F345)^(0.5))*(G345/$C$341)","v":7.8687044713731993}]
[null,3,324.55459216441875,105335.68329501219,1433.1800987945705,2054005.195580815,7.3333333333333339,7.8612474167376822]
[null,4,200.38792549775206,40155.320685292631,701.39857374568169,491959.95925247646,29,29.528159106445806]
[null,5,107.38792549775206,11532.166542710747,381.14344755901504,145270.32761717166,17,17.091818153935737]
[null,6,23.387925497752065,546.99505908840115,72.310017372348398,5228.7386123893275,11,11.0021940900535]
[null,7,-26.112074502247935,681.84043481094682,-188.13926262765159,35396.382142076458,10,10.012452963641859]
[null,8,-122.11207450224794,14911.358739242551,-512.20162081431818,262350.50036481459,42,42.400288112935982]
[null,9,-218.36207450224794,47681.995580925279,-836.58124833431816,699868.18506460614,10.5,10.767686585490365]
[null,10,-228.86207450224794,52377.849145472486,-849.90656033431821,722341.16129931214,10.5,10.777290126893051]
[null,11,-239.36207450224794,57294.202710019694,-863.23187233431827,745169.26541381271,10.5,10.787088315706253]
[null,12,-249.86207450224794,62431.056274566901,-876.55718433431832,768352.49740810809,10.5,10.79708062201116]
[null,13,-249.86207450224794,62431.056274566901,-876.55718433431832,768352.49740810809,0,0]
[null,14,-249.86207450224794,62431.056274566901,-876.55718433431832,768352.49740810809,0,0]
[null,15,-249.86207450224794,{"$f":"C358*C358","v":62431.056274566901},-876.55718433431832,{"$f":"E358*E358","v":768352.49740810809},0,{"$f":"(($F$341+D358+F358)^(0.5))*(G358/$C$341)","v":0}]
[null,null,null,null,null,null,"Total:",{"$f":"SUM(H344:H358)","v":176.77265687324277}]
[null,null,"Actual Length :",null,{"$f":"E239","v":174.08384584702171}]
[null,null,"Percentage Difference:",null,{"$f":"(ABS(H359-E360)/E360)*100","v":1.5445494170572758},"%*"]
[]
[null,"* The Percentage Difference should be 0.00 % "]
[]
[]
["Determine Fx - Group III (Dead + Ice + 0.5 · Wind)"]
[]
[null,"Value for Fx:",2468.3083891027918,null,"Fx2 =",{"$f":"C368*C368","v":6092546.3037152188}]
[]
[null,"Location","Fyi","Fyi2","Fzi","Fzi2","xi","Vector Component"]
[null,{"$f":"B120","v":1},{"$f":"F171+F321","v":569.20669877970454},{"$f":"C371*C371","v":323996.26593568927},{"$f":"0.5*F271","v":727.23664139728521},{"$f":"E371*E371","v":528873.13259080355},{"$f":"D222","v":7.333333333333333},{"$f":"(($F$368+D371+F371)^(0.5))*(G371/$C$368)","v":7.8298082985718302}]
[null,2,{"$f":"F172+F322","v":549.40669877970447},{"$f":"C372*C372","v":301847.72066401294},{"$f":"0.5*F272","v":721.24333295284077},{"$f":"E372*E372","v":520191.94532892236},{"$f":"D223","v":7.333333333333333},{"$f":"(($F$368+D372+F372)^(0.5))*(G372/$C$368)","v":7.8124112573206936}]
[null,3,539.14003211303782,290671.97422684747,716.59004939728527,513501.29889520374,7.3333333333333339,7.8023116005966635]
[null,4,343.71669877970453,118141.16902001813,350.69928687284084,122989.98981311911,29,29.568313240064306]
[null,5,182.95669877970448,33473.153628367516,190.57172377950752,36317.581904292914,17,17.097091106295899]
[null,6,34.796698779704499,1210.8102459654885,36.155008686174199,1307.1846530973319,11,11.002272865996595]
[null,7,-41.403301220295504,1714.2333519385231,-94.069631313825795,8849.0955355191145,10,10.008665304800285]
[null,8,-206.36330122029551,42585.81209053842,-256.10081040715909,65587.625091203648,42,42.371215469500996]
[null,9,-371.67330122029551,138141.04283999253,-418.29062416715908,174967.04626615153,10.5,10.766427777379816]
[null,10,-386.3733012202955,149284.32789586921,-424.95328016715911,180585.29032482803,10.5,10.78050470716963]
[null,11,-401.07330122029549,160859.79295174588,-431.61593616715913,186292.31635345318,10.5,10.794999938096263]
[null,12,-415.77330122029548,172867.43800762255,-438.27859216715916,192088.12435202702,10.5,10.8099117874343]
[null,13,-415.77330122029548,172867.43800762255,-438.27859216715916,192088.12435202702,0,0]
[null,14,-415.77330122029548,172867.43800762255,-438.27859216715916,192088.12435202702,0,0]
[null,15,-415.77330122029548,172867.43800762255,-438.27859216715916,192088.12435202702,0,0]
[null,null,null,null,null,null,"Total:",{"$f":"SUM(H371:H385)","v":176.64393335322725}]
[null,null,"Actual Length :",null,{"$f":"E239","v":174.08384584702171}]
[null,null,"Percentage Difference:",null,{"$f":"(ABS(H386-E387)/E387)*100","v":1.4706060138717616},"%*"]
[]
[null,"* The Percentage Difference should be 0.00 % "]
[]
[]
[]
["FINAL RESULTS:"]
[]
[null,"Span Wire Present:",{"$f":"Input!I49","v":"YES"}]
[]
["Support Reactions:"]
["Support 1 (Left)",null,null,"Support 2 (Right)",null,null,"Group Load"]
["Fx","Fy","Fz","Fx","Fy","Fz"]
[{"$f":"IF(C396=\"YES\",C215,0)","v":1759.830636209399},{"$f":"IF(C396=\"YES\",C164,0)","v":249.86207450224794},{"$f":"0","v":0},{"$f":"IF(C396=\"YES\",C215,0)","v":1759.830636209399},{"$f":"IF(C396=\"YES\",C167,0)","v":342.88792549775206},{"$f":"0","v":0},"Group I","(DL)"]
[{"$f":"IF(C396=\"YES\",C341,0)","v":3804.8368981276994},{"$f":"IF(C396=\"YES\",C164,0)","v":249.86207450224794},{"$f":"IF(C396=\"YES\",C264,0)","v":876.55718433431832},{"$f":"IF(C396=\"YES\",C341,0)","v":3804.8368981276994},{"$f":"IF(C396=\"YES\",C167,0)","v":342.88792549775206},{"$f":"IF(C396=\"YES\",C267,0)","v":1454.4732827945704},"Group II","(DL + WL)"]
[{"$f":"IF(C396=\"YES\",C368,0)","v":2468.3083891027918},{"$f":"IF(C396=\"YES\",C164+C314,0)","v":415.77330122029548},{"$f":"IF(C396=\"YES\",0.5*C264,0)","v":438.27859216715916},{"$f":"IF(C396=\"YES\",C368,0)","v":2468.3083891027918},{"$f":"IF(C396=\"YES\",C167+C317,0)","v":569.20669877970454},{"$f":"IF(C396=\"YES\",0.5*C267,0)","v":727.23664139728521},"Group III","(DL + IL + 0.5 · WL)"]
[]
["Wire Tension:"]
["Support 1","Support 2","Group Load"]
[{"$f":"SQRT(A401^2+B401^2+C401^2)","v":1777.4799364312794},{"$f":"SQRT(D401^2+E401^2+F401^2)","v":1792.9238683204958},"Group I","(DL)"]
[{"$f":"SQRT(A402^2+B402^2+C402^2)","v":3912.4886421607271},{"$f":"SQRT(D402^2+E402^2+F402^2)","v":4087.7681540382619},"Group II","(DL + WL)"]
[{"$f":"SQRT(A403^2+B403^2+C403^2)","v":2541.1615190843081},{"$f":"SQRT(D403^2+E403^2+F403^2)","v":2635.4156602406597},"Group III","(DL + IL + 0.5 · WL)"]

{"sheet":"SW2","index":5,"n_rows":409,"n_cols":9,"rows_kept":409,"cut":false,"hidden":false,"merged":[[162,1,162,5],[2,1,2,8],[4,1,6,4],[20,4,20,5],[25,0,25,8],[48,2,53,2],[218,6,218,7],[398,0,398,2],[398,3,398,5],[398,6,399,8],[405,2,405,4]]}
["Strain Pole Design - SW2 Cable Stringing Tension"]
[]
["Assumptions:","This spreadsheet calculates the tension in strain poles for overhead sign in accordance with the AASHTO Specifications for Structural Supports for Highway Signs, Luminaires and Traffic Signals 4th Edition 2001, including the 2002 and 2003 Interims (Per DM-4), and the Pennsylvania Department of Transportation Criteria for the Design of Traffic Related Structures."]
[]
[null,"Number of assumed concentrated loads on the strain pole cable.  Also must consider concentrated cable loads with a minimum of 5 segments.",null,null,null," "," ",null,"Y"]
[null,null,null,null,null,"=",{"$f":"I51","v":12}]
[null,null,null,null,null,null,null,"M"]
[]
[null,"Support 1 (Left)",null,null,null,null,"X",null,"Support 2 (Right)      "]
[]
[]
[]
[null,null,null,null,null,null,"Loadn"]
[]
[]
[]
[null,null,null,null,null,null,"Xn"]
[]
[null,null,null,null,"Length"]
[]
[null,"Length:",{"$f":"L2_","v":145},"feet","Maximum Allowable Sag:",null,5,"percent"]
[]
[]
["Rank loading ID's from right to left ( Support 2 to Support 1) and calculate wire segment lengths:"]
[]
["The spreadsheet assumes that 3 wire segments are placed before the first point load and 2 wire segments are placed after the last point load.  The number of point loads is calculated by adding the number of point loads input and adding 5 point loads due to the wire segments."]
[]
[null,"Original Rank","Re-rank","Final Rank","Loading ID","Distance"]
[null,{"$f":"IF(F29<>\"N/A\",RANK(F29,$F$29:$F$37,1),\"Exclude\")","v":7},{"$f":"IF(ISNUMBER(B29)=TRUE,B29,MAX($B$29:$B$37)+1)","v":7},{"$f":"RANK(C29,$C$29:$C$37,1)","v":7},"M",{"$f":"IF(Input!H61=\"None\",\"N/A\",Input!I61)","v":117}]
[null,6,{"$f":"IF(ISNUMBER(B30)=TRUE,B30,MAX($B$29:$B$37)+2)","v":6},6,"N",{"$f":"IF(Input!H62=\"None\",\"N/A\",Input!I62)","v":70}]
[null,4,{"$f":"IF(ISNUMBER(B31)=TRUE,B31,MAX($B$29:$B$37)+3)","v":4},4,"O",{"$f":"IF(Input!H63=\"None\",\"N/A\",Input!I63)","v":55}]
[null,3,{"$f":"IF(ISNUMBER(B32)=TRUE,B32,MAX($B$29:$B$37)+4)","v":3},3,"P",{"$f":"IF(Input!H64=\"None\",\"N/A\",Input!I64)","v":42}]
[null,5,{"$f":"IF(ISNUMBER(B33)=TRUE,B33,MAX($B$29:$B$37)+5)","v":5},5,"R",{"$f":"IF(Input!G65=\"None\",\"N/A\",Input!I65)","v":65}]
[null,2,{"$f":"IF(ISNUMBER(B34)=TRUE,B34,MAX($B$29:$B$37)+6)","v":2},2,"S",{"$f":"IF(Input!G66=\"None\",\"N/A\",Input!I66)","v":36}]
[null,"Exclude",{"$f":"IF(ISNUMBER(B35)=TRUE,B35,MAX($B$29:$B$37)+7)","v":14},8,"T",{"$f":"IF(Input!G67=\"None\",\"N/A\",Input!I67)","v":"N/A"}]
[null,"Exclude",{"$f":"IF(ISNUMBER(B36)=TRUE,B36,MAX($B$29:$B$37)+8)","v":15},9,"U",{"$f":"IF(Input!G68=\"None\",\"N/A\",Input!I68)","v":"N/A"}]
[null,1,{"$f":"IF(ISNUMBER(B37)=TRUE,B37,MAX($B$29:$B$37)+9)","v":1},1,"Y",{"$f":"IF(Input!G69=\"None\",\"N/A\",Input!I69)","v":30}]
[]
[null,null,"Rank","Loading ID","Distance","Count"]
[null,null,1,{"$f":"VLOOKUP(C40,$D$29:$F$37,2,0)","v":"Y"},{"$f":"VLOOKUP(C40,$D$29:$F$37,3,0)","v":30},{"$f":"IF(E40<>\"N/A\",1,0)","v":1}]
[null,null,2,"S",36,1]
[null,null,3,"P",42,1]
[null,null,4,"O",55,1]
[null,null,5,"R",65,1]
[null,null,6,"N",70,1]
[null,null,7,"M",117,1]
[null,null,8,"T","N/A",0]
[null,null,9,"U","N/A",0]
[null,null,"Wire Sections","W1",{"$f":"MIN(E40:E48)/3","v":10}]
[null,null,null,"W2",{"$f":"MIN(E40:E48)/3+E49","v":20},null,null,"Number of Point Loads:",{"$f":"SUM(F40:F48)","v":7}]
[null,null,null,"W3",{"$f":"(C21-MAX(E40:E48))/4+MAX(E40:E48)","v":124},null,null,"No. of Point Loads w/ Wire Segments:",{"$f":"I50+5","v":12}]
[null,null,null,"W4",{"$f":"(C21-MAX(E40:E48))/4+E51","v":131}]
[null,null,null,"W5",{"$f":"(C21-MAX(E40:E48))/4+E52","v":138}]
[null,null,null,"W6",{"$f":"C21","v":145}]
[]
[]
["Rank ID's and Wire Segments from right to left ( Support 2 to Support 1) and calculate loading:"]
[]
[null,null,"Original Rank With Wire","Re-rank","Final Rank","Loading ID","Distance"]
[null,null,{"$f":"IF(E40<>\"N/A\",RANK(E40,$E$40:$E$54,1),\"Exclude\")","v":3},{"$f":"IF(ISNUMBER(C60)=TRUE,C60,MAX($C$60:$C$74)+1)","v":3},{"$f":"RANK(D60,$D$60:$D$74,1)","v":3},{"$f":"D40","v":"Y"},30]
[null,null,4,{"$f":"IF(ISNUMBER(C61)=TRUE,C61,MAX($C$60:$C$74)+2)","v":4},4,"S",36]
[null,null,5,{"$f":"IF(ISNUMBER(C62)=TRUE,C62,MAX($C$60:$C$74)+3)","v":5},5,"P",42]
[null,null,6,{"$f":"IF(ISNUMBER(C63)=TRUE,C63,MAX($C$60:$C$74)+4)","v":6},6,"O",55]
[null,null,7,{"$f":"IF(ISNUMBER(C64)=TRUE,C64,MAX($C$60:$C$74)+5)","v":7},7,"R",65]
[null,null,8,{"$f":"IF(ISNUMBER(C65)=TRUE,C65,MAX($C$60:$C$74)+6)","v":8},8,"N",70]
[null,null,9,{"$f":"IF(ISNUMBER(C66)=TRUE,C66,MAX($C$60:$C$74)+7)","v":9},9,"M",117]
[null,null,"Exclude",{"$f":"IF(ISNUMBER(C67)=TRUE,C67,MAX($C$60:$C$74)+8)","v":21},14,"T","N/A"]
[null,null,"Exclude",{"$f":"IF(ISNUMBER(C68)=TRUE,C68,MAX($C$60:$C$74)+9)","v":22},15,"U","N/A"]
[null,null,1,{"$f":"IF(ISNUMBER(C69)=TRUE,C69,MAX($C$60:$C$74)+10)","v":1},1,"W1",10]
[null,null,2,{"$f":"IF(ISNUMBER(C70)=TRUE,C70,MAX($C$60:$C$74)+11)","v":2},2,"W2",20]
[null,null,10,{"$f":"IF(ISNUMBER(C71)=TRUE,C71,MAX($C$60:$C$74)+12)","v":10},10,"W3",124]
[null,null,11,{"$f":"IF(ISNUMBER(C72)=TRUE,C72,MAX($C$60:$C$74)+13)","v":11},11,"W4",131]
[null,null,12,{"$f":"IF(ISNUMBER(C73)=TRUE,C73,MAX($C$60:$C$74)+14)","v":12},12,"W5",138]
[null,null,13,{"$f":"IF(ISNUMBER(C74)=TRUE,C74,MAX($C$60:$C$74)+15)","v":13},13,"W6",145]
[]
[null,"Final Rank","Loading ID","Distance","Distance for Table","Load description","Signal Config/Sign Size/Wire Dia"]
[null,1,{"$f":"VLOOKUP(B77,$E$60:$G$74,2,0)","v":"W1"},{"$f":"VLOOKUP(B77,$E$60:$G$74,3,0)","v":10},{"$f":"IF(ISNUMBER(D77),D77,0)","v":10},{"$f":"IF(OR(C77=$D$49,C77=$D$50,C77=$D$51,C77=$D$52,C77=$D$53,C77=$D$54),\"Wire\",VLOOKUP(C77,Input!$B$61:$C$69,2,0))","v":"Wire"},{"$f":"IF(F77=\"Signal\",VLOOKUP(C77,Input!$B$61:$I$69,7,0),IF(F77=\"Sign\",VLOOKUP(C77,Input!$B$61:$I$69,6,0),SW2_Wire_Dia))","v":"0.5\""}]
[null,2,"W2",20,20,{"$f":"IF(OR(C78=$D$49,C78=$D$50,C78=$D$51,C78=$D$52,C78=$D$53,C78=$D$54),\"Wire\",VLOOKUP(C78,Input!$B$61:$C$69,2,0))","v":"Wire"},{"$f":"IF(F78=\"Signal\",VLOOKUP(C78,Input!$B$61:$I$69,7,0),IF(F78=\"Sign\",VLOOKUP(C78,Input!$B$61:$I$69,6,0),SW2_Wire_Dia))","v":"0.5\""}]
[null,3,"Y",30,30,{"$f":"IF(OR(C79=$D$49,C79=$D$50,C79=$D$51,C79=$D$52,C79=$D$53,C79=$D$54),\"Wire\",VLOOKUP(C79,Input!$B$61:$C$69,2,0))","v":"Sign"},{"$f":"IF(F79=\"Signal\",VLOOKUP(C79,Input!$B$61:$I$69,7,0),IF(F79=\"Sign\",VLOOKUP(C79,Input!$B$61:$I$69,6,0),SW2_Wire_Dia))","v":"96\" x 32\""}]
[null,4,"S",36,36,{"$f":"IF(OR(C80=$D$49,C80=$D$50,C80=$D$51,C80=$D$52,C80=$D$53,C80=$D$54),\"Wire\",VLOOKUP(C80,Input!$B$61:$C$69,2,0))","v":"Sign"},{"$f":"IF(F80=\"Signal\",VLOOKUP(C80,Input!$B$61:$I$69,7,0),IF(F80=\"Sign\",VLOOKUP(C80,Input!$B$61:$I$69,6,0),SW2_Wire_Dia))","v":"30\" x 36\""}]
[null,5,"P",42,42,{"$f":"IF(OR(C81=$D$49,C81=$D$50,C81=$D$51,C81=$D$52,C81=$D$53,C81=$D$54),\"Wire\",VLOOKUP(C81,Input!$B$61:$C$69,2,0))","v":"Signal"},{"$f":"IF(F81=\"Signal\",VLOOKUP(C81,Input!$B$61:$I$69,7,0),IF(F81=\"Sign\",VLOOKUP(C81,Input!$B$61:$I$69,6,0),SW2_Wire_Dia))","v":"A-5"}]
[null,6,"O",55,55,{"$f":"IF(OR(C82=$D$49,C82=$D$50,C82=$D$51,C82=$D$52,C82=$D$53,C82=$D$54),\"Wire\",VLOOKUP(C82,Input!$B$61:$C$69,2,0))","v":"Signal"},{"$f":"IF(F82=\"Signal\",VLOOKUP(C82,Input!$B$61:$I$69,7,0),IF(F82=\"Sign\",VLOOKUP(C82,Input!$B$61:$I$69,6,0),SW2_Wire_Dia))","v":"A-3"}]
[null,7,"R",65,65,{"$f":"IF(OR(C83=$D$49,C83=$D$50,C83=$D$51,C83=$D$52,C83=$D$53,C83=$D$54),\"Wire\",VLOOKUP(C83,Input!$B$61:$C$69,2,0))","v":"Sign"},{"$f":"IF(F83=\"Signal\",VLOOKUP(C83,Input!$B$61:$I$69,7,0),IF(F83=\"Sign\",VLOOKUP(C83,Input!$B$61:$I$69,6,0),SW2_Wire_Dia))","v":"30\" x 36\""}]
[null,8,"N",70,70,{"$f":"IF(OR(C84=$D$49,C84=$D$50,C84=$D$51,C84=$D$52,C84=$D$53,C84=$D$54),\"Wire\",VLOOKUP(C84,Input!$B$61:$C$69,2,0))","v":"Signal"},{"$f":"IF(F84=\"Signal\",VLOOKUP(C84,Input!$B$61:$I$69,7,0),IF(F84=\"Sign\",VLOOKUP(C84,Input!$B$61:$I$69,6,0),SW2_Wire_Dia))","v":"A-3"}]
[null,9,"M",117,117,{"$f":"IF(OR(C85=$D$49,C85=$D$50,C85=$D$51,C85=$D$52,C85=$D$53,C85=$D$54),\"Wire\",VLOOKUP(C85,Input!$B$61:$C$69,2,0))","v":"Signal"},{"$f":"IF(F85=\"Signal\",VLOOKUP(C85,Input!$B$61:$I$69,7,0),IF(F85=\"Sign\",VLOOKUP(C85,Input!$B$61:$I$69,6,0),SW2_Wire_Dia))","v":"A-3"}]
[null,10,"W3",124,124,{"$f":"IF(OR(C86=$D$49,C86=$D$50,C86=$D$51,C86=$D$52,C86=$D$53,C86=$D$54),\"Wire\",VLOOKUP(C86,Input!$B$61:$C$69,2,0))","v":"Wire"},{"$f":"IF(F86=\"Signal\",VLOOKUP(C86,Input!$B$61:$I$69,7,0),IF(F86=\"Sign\",VLOOKUP(C86,Input!$B$61:$I$69,6,0),SW2_Wire_Dia))","v":"0.5\""}]
[null,11,"W4",131,131,{"$f":"IF(OR(C87=$D$49,C87=$D$50,C87=$D$51,C87=$D$52,C87=$D$53,C87=$D$54),\"Wire\",VLOOKUP(C87,Input!$B$61:$C$69,2,0))","v":"Wire"},{"$f":"IF(F87=\"Signal\",VLOOKUP(C87,Input!$B$61:$I$69,7,0),IF(F87=\"Sign\",VLOOKUP(C87,Input!$B$61:$I$69,6,0),SW2_Wire_Dia))","v":"0.5\""}]
[null,12,"W5",138,138,{"$f":"IF(OR(C88=$D$49,C88=$D$50,C88=$D$51,C88=$D$52,C88=$D$53,C88=$D$54),\"Wire\",VLOOKUP(C88,Input!$B$61:$C$69,2,0))","v":"Wire"},{"$f":"IF(F88=\"Signal\",VLOOKUP(C88,Input!$B$61:$I$69,7,0),IF(F88=\"Sign\",VLOOKUP(C88,Input!$B$61:$I$69,6,0),SW2_Wire_Dia))","v":"0.5\""}]
[null,13,"W6",145,145,{"$f":"IF(OR(C89=$D$49,C89=$D$50,C89=$D$51,C89=$D$52,C89=$D$53,C89=$D$54),\"Wire\",VLOOKUP(C89,Input!$B$61:$C$69,2,0))","v":"Wire"},{"$f":"IF(F89=\"Signal\",VLOOKUP(C89,Input!$B$61:$I$69,7,0),IF(F89=\"Sign\",VLOOKUP(C89,Input!$B$61:$I$69,6,0),SW2_Wire_Dia))","v":"0.5\""}]
[null,14,"T","N/A",0,{"$f":"IF(OR(C90=$D$49,C90=$D$50,C90=$D$51,C90=$D$52,C90=$D$53,C90=$D$54),\"Wire\",VLOOKUP(C90,Input!$B$61:$C$69,2,0))","v":"Sign"},{"$f":"IF(F90=\"Signal\",VLOOKUP(C90,Input!$B$61:$I$69,7,0),IF(F90=\"Sign\",VLOOKUP(C90,Input!$B$61:$I$69,6,0),SW2_Wire_Dia))","v":"None"}]
[null,15,"U","N/A",0,{"$f":"IF(OR(C91=$D$49,C91=$D$50,C91=$D$51,C91=$D$52,C91=$D$53,C91=$D$54),\"Wire\",VLOOKUP(C91,Input!$B$61:$C$69,2,0))","v":"Sign"},{"$f":"IF(F91=\"Signal\",VLOOKUP(C91,Input!$B$61:$I$69,7,0),IF(F91=\"Sign\",VLOOKUP(C91,Input!$B$61:$I$69,6,0),SW2_Wire_Dia))","v":"None"}]
[]
["Calculate Loads:"]
[]
[null,"Wire Weights:"]
[null,null,"Wire Weight =",{"$f":"VLOOKUP(SW1_Wire_Dia,'Pick Lists & Data'!A29:B33,2,0)","v":1},"lb/ft"]
[null,null,"Wire Wind Load =",{"$f":"VLOOKUP(SW1_Wire_Dia,'Pick Lists & Data'!A29:L33,10,0)","v":1.2690773333333334},"lb/ft"]
[null,null,"Wire Ice Load =",{"$f":"VLOOKUP(SW1_Wire_Dia,'Pick Lists & Data'!A29:L33,12,0)","v":0.4},"lb/ft"]
[]
["Loading Final Rank","Distance for Table","Signal Config/Sign Size/Wire Dia","Wire Segment Dead Load","Signal/Sign Dead Load","Wire Segment Wind Load","Signal/Sign Wind Load","Wire Segment Ice Load","Signal/Sign Ice Load"]
[{"$f":"B77","v":1},{"$f":"E77","v":10},{"$f":"G77","v":"0.5\""},{"$f":"$D$77+($D$78-$D$77)*0.5*$D$96","v":15},{"$f":"IF($F77=\"Wire\",0,IF($F77=\"Sign\",VLOOKUP($G77,'Pick Lists & Data'!$A$39:$G$43,2,0),VLOOKUP($G77,'Pick Lists & Data'!$A$11:$H$25,2,0)))","v":0},{"$f":"$D$77+($D$78-$D$77)*0.5*$D$97","v":16.345386666666666},{"$f":"IF($F77=\"Wire\",0,IF($F77=\"Sign\",VLOOKUP($G77,'Pick Lists & Data'!$A$39:$G$43,6,0),VLOOKUP($G77,'Pick Lists & Data'!$A$11:$H$25,6,0)))","v":0},{"$f":"$D$77+($D$78-$D$77)*0.5*$D$98","v":12},{"$f":"IF($F77=\"Wire\",0,IF($F77=\"Sign\",VLOOKUP($G77,'Pick Lists & Data'!$A$39:$G$43,7,0),VLOOKUP($G77,'Pick Lists & Data'!$A$11:$H$25,8,0)))","v":0}]
[2,20,"0.5\"",{"$f":"IF($E79=0,0,IF($E78<$C$21,(($E78-$E77)*0.5+($E79-$E78)*0.5)*$D$96,(($E78-$E77)*0.5+($E79-E$78))*$D$96))","v":10},{"$f":"IF(F78=\"Wire\",0,IF(F78=\"Sign\",VLOOKUP(G78,'Pick Lists & Data'!$A$39:$G$43,2,0),VLOOKUP(G78,'Pick Lists & Data'!$A$11:$H$25,2,0)))","v":0},{"$f":"IF($E79=0,0,IF($E78<$C$21,(($E78-$E77)*0.5+($E79-$E78)*0.5)*$D$97,(($E78-$E77)*0.5+($E79-G$78))*$D$97))","v":12.690773333333334},{"$f":"IF($F78=\"Wire\",0,IF($F78=\"Sign\",VLOOKUP($G78,'Pick Lists & Data'!$A$39:$G$43,6,0),VLOOKUP($G78,'Pick Lists & Data'!$A$11:$H$25,6,0)))","v":0},{"$f":"IF($E79=0,0,IF($E78<$C$21,(($E78-$E77)*0.5+($E79-$E78)*0.5)*$D$98,(($E78-$E77)*0.5+($E79-E$102))*$D$98))","v":4},{"$f":"IF($F78=\"Wire\",0,IF($F78=\"Sign\",VLOOKUP($G78,'Pick Lists & Data'!$A$39:$G$43,7,0),VLOOKUP($G78,'Pick Lists & Data'!$A$11:$H$25,8,0)))","v":0}]
[3,30,"96\" x 32\"",8,{"$f":"IF(F79=\"Wire\",0,IF(F79=\"Sign\",VLOOKUP(G79,'Pick Lists & Data'!$A$39:$G$43,2,0),VLOOKUP(G79,'Pick Lists & Data'!$A$11:$H$25,2,0)))","v":106},10.152618666666667,{"$f":"IF($F79=\"Wire\",0,IF($F79=\"Sign\",VLOOKUP($G79,'Pick Lists & Data'!$A$39:$G$43,6,0),VLOOKUP($G79,'Pick Lists & Data'!$A$11:$H$25,6,0)))","v":708.72662015999992},3.2,{"$f":"IF($F79=\"Wire\",0,IF($F79=\"Sign\",VLOOKUP($G79,'Pick Lists & Data'!$A$39:$G$43,7,0),VLOOKUP($G79,'Pick Lists & Data'!$A$11:$H$25,8,0)))","v":63.989999999999995}]
[4,36,"30\" x 36\"",6,{"$f":"IF(F80=\"Wire\",0,IF(F80=\"Sign\",VLOOKUP(G80,'Pick Lists & Data'!$A$39:$G$43,2,0),VLOOKUP(G80,'Pick Lists & Data'!$A$11:$H$25,2,0)))","v":39},7.6144639999999999,{"$f":"IF($F80=\"Wire\",0,IF($F80=\"Sign\",VLOOKUP($G80,'Pick Lists & Data'!$A$39:$G$43,6,0),VLOOKUP($G80,'Pick Lists & Data'!$A$11:$H$25,6,0)))","v":247.12396799999999},2.4000000000000004,{"$f":"IF($F80=\"Wire\",0,IF($F80=\"Sign\",VLOOKUP($G80,'Pick Lists & Data'!$A$39:$G$43,7,0),VLOOKUP($G80,'Pick Lists & Data'!$A$11:$H$25,8,0)))","v":22.5}]
[5,42,"A-5",9.5,{"$f":"IF(F81=\"Wire\",0,IF(F81=\"Sign\",VLOOKUP(G81,'Pick Lists & Data'!$A$39:$G$43,2,0),VLOOKUP(G81,'Pick Lists & Data'!$A$11:$H$25,2,0)))","v":97},12.056234666666667,{"$f":"IF($F81=\"Wire\",0,IF($F81=\"Sign\",VLOOKUP($G81,'Pick Lists & Data'!$A$39:$G$43,6,0),VLOOKUP($G81,'Pick Lists & Data'!$A$11:$H$25,6,0)))","v":461.51958528},3.8000000000000003,{"$f":"IF($F81=\"Wire\",0,IF($F81=\"Sign\",VLOOKUP($G81,'Pick Lists & Data'!$A$39:$G$43,7,0),VLOOKUP($G81,'Pick Lists & Data'!$A$11:$H$25,8,0)))","v":89.34}]
[6,55,"A-3",11.5,{"$f":"IF(F82=\"Wire\",0,IF(F82=\"Sign\",VLOOKUP(G82,'Pick Lists & Data'!$A$39:$G$43,2,0),VLOOKUP(G82,'Pick Lists & Data'!$A$11:$H$25,2,0)))","v":70},14.594389333333334,{"$f":"IF($F82=\"Wire\",0,IF($F82=\"Sign\",VLOOKUP($G82,'Pick Lists & Data'!$A$39:$G$43,6,0),VLOOKUP($G82,'Pick Lists & Data'!$A$11:$H$25,6,0)))","v":291.06634751999997},4.6000000000000005,{"$f":"IF($F82=\"Wire\",0,IF($F82=\"Sign\",VLOOKUP($G82,'Pick Lists & Data'!$A$39:$G$43,7,0),VLOOKUP($G82,'Pick Lists & Data'!$A$11:$H$25,8,0)))","v":58.56}]
[7,65,"30\" x 36\"",7.5,{"$f":"IF(F83=\"Wire\",0,IF(F83=\"Sign\",VLOOKUP(G83,'Pick Lists & Data'!$A$39:$G$43,2,0),VLOOKUP(G83,'Pick Lists & Data'!$A$11:$H$25,2,0)))","v":39},9.5180800000000012,{"$f":"IF($F83=\"Wire\",0,IF($F83=\"Sign\",VLOOKUP($G83,'Pick Lists & Data'!$A$39:$G$43,6,0),VLOOKUP($G83,'Pick Lists & Data'!$A$11:$H$25,6,0)))","v":247.12396799999999},3,{"$f":"IF($F83=\"Wire\",0,IF($F83=\"Sign\",VLOOKUP($G83,'Pick Lists & Data'!$A$39:$G$43,7,0),VLOOKUP($G83,'Pick Lists & Data'!$A$11:$H$25,8,0)))","v":22.5}]
[8,70,"A-3",26,{"$f":"IF(F84=\"Wire\",0,IF(F84=\"Sign\",VLOOKUP(G84,'Pick Lists & Data'!$A$39:$G$43,2,0),VLOOKUP(G84,'Pick Lists & Data'!$A$11:$H$25,2,0)))","v":70},32.99601066666667,{"$f":"IF($F84=\"Wire\",0,IF($F84=\"Sign\",VLOOKUP($G84,'Pick Lists & Data'!$A$39:$G$43,6,0),VLOOKUP($G84,'Pick Lists & Data'!$A$11:$H$25,6,0)))","v":291.06634751999997},10.4,{"$f":"IF($F84=\"Wire\",0,IF($F84=\"Sign\",VLOOKUP($G84,'Pick Lists & Data'!$A$39:$G$43,7,0),VLOOKUP($G84,'Pick Lists & Data'!$A$11:$H$25,8,0)))","v":58.56}]
[9,117,"A-3",27,{"$f":"IF(F85=\"Wire\",0,IF(F85=\"Sign\",VLOOKUP(G85,'Pick Lists & Data'!$A$39:$G$43,2,0),VLOOKUP(G85,'Pick Lists & Data'!$A$11:$H$25,2,0)))","v":70},34.265087999999999,{"$f":"IF($F85=\"Wire\",0,IF($F85=\"Sign\",VLOOKUP($G85,'Pick Lists & Data'!$A$39:$G$43,6,0),VLOOKUP($G85,'Pick Lists & Data'!$A$11:$H$25,6,0)))","v":291.06634751999997},10.8,{"$f":"IF($F85=\"Wire\",0,IF($F85=\"Sign\",VLOOKUP($G85,'Pick Lists & Data'!$A$39:$G$43,7,0),VLOOKUP($G85,'Pick Lists & Data'!$A$11:$H$25,8,0)))","v":58.56}]
[10,124,"0.5\"",7,{"$f":"IF(F86=\"Wire\",0,IF(F86=\"Sign\",VLOOKUP(G86,'Pick Lists & Data'!$A$39:$G$43,2,0),VLOOKUP(G86,'Pick Lists & Data'!$A$11:$H$25,2,0)))","v":0},8.8835413333333335,{"$f":"IF($F86=\"Wire\",0,IF($F86=\"Sign\",VLOOKUP($G86,'Pick Lists & Data'!$A$39:$G$43,6,0),VLOOKUP($G86,'Pick Lists & Data'!$A$11:$H$25,6,0)))","v":0},2.8000000000000003,{"$f":"IF($F86=\"Wire\",0,IF($F86=\"Sign\",VLOOKUP($G86,'Pick Lists & Data'!$A$39:$G$43,7,0),VLOOKUP($G86,'Pick Lists & Data'!$A$11:$H$25,8,0)))","v":0}]
[11,131,"0.5\"",7,{"$f":"IF(F87=\"Wire\",0,IF(F87=\"Sign\",VLOOKUP(G87,'Pick Lists & Data'!$A$39:$G$43,2,0),VLOOKUP(G87,'Pick Lists & Data'!$A$11:$H$25,2,0)))","v":0},8.8835413333333335,{"$f":"IF($F87=\"Wire\",0,IF($F87=\"Sign\",VLOOKUP($G87,'Pick Lists & Data'!$A$39:$G$43,6,0),VLOOKUP($G87,'Pick Lists & Data'!$A$11:$H$25,6,0)))","v":0},2.8000000000000003,{"$f":"IF($F87=\"Wire\",0,IF($F87=\"Sign\",VLOOKUP($G87,'Pick Lists & Data'!$A$39:$G$43,7,0),VLOOKUP($G87,'Pick Lists & Data'!$A$11:$H$25,8,0)))","v":0}]
[12,138,"0.5\"",7,{"$f":"IF(F88=\"Wire\",0,IF(F88=\"Sign\",VLOOKUP(G88,'Pick Lists & Data'!$A$39:$G$43,2,0),VLOOKUP(G88,'Pick Lists & Data'!$A$11:$H$25,2,0)))","v":0},8.8835413333333335,{"$f":"IF($F88=\"Wire\",0,IF($F88=\"Sign\",VLOOKUP($G88,'Pick Lists & Data'!$A$39:$G$43,6,0),VLOOKUP($G88,'Pick Lists & Data'!$A$11:$H$25,6,0)))","v":0},2.8000000000000003,{"$f":"IF($F88=\"Wire\",0,IF($F88=\"Sign\",VLOOKUP($G88,'Pick Lists & Data'!$A$39:$G$43,7,0),VLOOKUP($G88,'Pick Lists & Data'!$A$11:$H$25,8,0)))","v":0}]
[13,145,"0.5\"",0,{"$f":"IF(F89=\"Wire\",0,IF(F89=\"Sign\",VLOOKUP(G89,'Pick Lists & Data'!$A$39:$G$43,2,0),VLOOKUP(G89,'Pick Lists & Data'!$A$11:$H$25,2,0)))","v":0},0,{"$f":"IF($F89=\"Wire\",0,IF($F89=\"Sign\",VLOOKUP($G89,'Pick Lists & Data'!$A$39:$G$43,6,0),VLOOKUP($G89,'Pick Lists & Data'!$A$11:$H$25,6,0)))","v":0},0,{"$f":"IF($F89=\"Wire\",0,IF($F89=\"Sign\",VLOOKUP($G89,'Pick Lists & Data'!$A$39:$G$43,7,0),VLOOKUP($G89,'Pick Lists & Data'!$A$11:$H$25,8,0)))","v":0}]
[14,0,"None",0,{"$f":"IF(F90=\"Wire\",0,IF(F90=\"Sign\",VLOOKUP(G90,'Pick Lists & Data'!$A$39:$G$43,2,0),VLOOKUP(G90,'Pick Lists & Data'!$A$11:$H$25,2,0)))","v":0},0,{"$f":"IF($F90=\"Wire\",0,IF($F90=\"Sign\",VLOOKUP($G90,'Pick Lists & Data'!$A$39:$G$43,6,0),VLOOKUP($G90,'Pick Lists & Data'!$A$11:$H$25,6,0)))","v":0},0,{"$f":"IF($F90=\"Wire\",0,IF($F90=\"Sign\",VLOOKUP($G90,'Pick Lists & Data'!$A$39:$G$43,7,0),VLOOKUP($G90,'Pick Lists & Data'!$A$11:$H$25,8,0)))","v":0}]
[15,0,"None",{"$f":"IF($T162=0,0,IF($E91<$C$21,(($E91-$E90)*0.5+($T162-$E91)*0.5)*$D$96,(($E91-$E90)*0.5+($T162-E$78))*$D$96))","v":0},{"$f":"IF(F91=\"Wire\",0,IF(F91=\"Sign\",VLOOKUP(G91,'Pick Lists & Data'!$A$39:$G$43,2,0),VLOOKUP(G91,'Pick Lists & Data'!$A$11:$H$25,2,0)))","v":0},{"$f":"IF($T162=0,0,IF($E91<$C$21,(($E91-$E90)*0.5+($T162-$E91)*0.5)*$D$97,(($E91-$E90)*0.5+($T162-G$78))*$D$97))","v":0},{"$f":"IF($F91=\"Wire\",0,IF($F91=\"Sign\",VLOOKUP($G91,'Pick Lists & Data'!$A$39:$G$43,6,0),VLOOKUP($G91,'Pick Lists & Data'!$A$11:$H$25,6,0)))","v":0},{"$f":"IF($T162=0,0,IF($E91<$C$21,(($E91-$E90)*0.5+($T162-$E91)*0.5)*$D$98,(($E91-$E90)*0.5+($T162-E$102))*$D$98))","v":0},{"$f":"IF($F91=\"Wire\",0,IF($F91=\"Sign\",VLOOKUP($G91,'Pick Lists & Data'!$A$39:$G$43,7,0),VLOOKUP($G91,'Pick Lists & Data'!$A$11:$H$25,8,0)))","v":0}]
[]
["Place Distances and Loads into table for span wire analysis"]
[]
[null,"Loading Final Rank","Distance (Xn)","Dead Load","Wind Load","Ice Load","Load Description","Signal Config/Sign Size/Wire Diameter"]
[null,1,{"$f":"B101","v":10},{"$f":"SUM(D101:E101)","v":15},{"$f":"SUM(F101:G101)","v":16.345386666666666},{"$f":"SUM(H101:I101)","v":12},{"$f":"F77","v":"Wire"},{"$f":"C101","v":"0.5\""}]
[null,2,{"$f":"B102","v":20},{"$f":"SUM(D102:E102)","v":10},{"$f":"SUM(F102:G102)","v":12.690773333333334},{"$f":"SUM(H102:I102)","v":4},"Wire",{"$f":"C102","v":"0.5\""}]
[null,3,30,114,718.87923882666655,67.19,"Sign","96\" x 32\""]
[null,4,36,45,254.73843199999999,24.9,"Sign","30\" x 36\""]
[null,5,42,106.5,473.57581994666668,93.14,"Signal","A-5"]
[null,6,55,81.5,305.66073685333328,63.160000000000004,"Signal","A-3"]
[null,7,65,46.5,256.64204799999999,25.5,"Sign","30\" x 36\""]
[null,8,70,96,324.06235818666664,68.960000000000008,"Signal","A-3"]
[null,9,117,97,325.33143551999996,69.36,"Signal","A-3"]
[null,10,124,7,8.8835413333333335,2.8000000000000003,"Wire","0.5\""]
[null,11,131,7,8.8835413333333335,2.8000000000000003,"Wire","0.5\""]
[null,12,138,7,8.8835413333333335,2.8000000000000003,"Wire","0.5\""]
[null,13,145,0,0,0,"Wire","0.5\""]
[null,14,0,0,0,0,"Sign","None"]
[null,15,0,0,0,0,"Sign","None"]
[null,null,null,{"$f":"SUM(D120:D134)","v":632.5},{"$f":"SUM(E120:E134)","v":2714.5768533333326}]
[]
[null,"* Distances MUST be entered in order, starting with the load closest to Support 1 and moving"]
[null,"right towards Support 2.  If all 14 loads are not used, a \"null distance\" and a \"null load\" must be "]
[null,"assigned to the worksheet cell (ie. Enter a zero for each null value.)"]
[]
["Dead Load (Group I Loading, also used for Groups II and III)"]
[]
["Calculate Dead Load Reactions:"]
[null,"Summing moments about Support 2 (Counter clockwise-moments positive):"]
[]
[null,"Loading","Dead Load","Arm","Moment"]
[null,{"$f":"B120","v":1},{"$f":"D120","v":15},{"$f":"C120","v":10},{"$f":"C147*D147","v":150}]
[null,2,10,20,200]
[null,3,114,30,3420]
[null,4,45,36,1620]
[null,5,106.5,42,4473]
[null,6,81.5,55,4482.5]
[null,7,46.5,65,3022.5]
[null,8,96,70,6720]
[null,9,97,117,11349]
[null,10,7,124,868]
[null,11,7,131,917]
[null,12,7,138,966]
[null,13,0,145,0]
[null,14,0,0,0]
[null,15,0,0,0]
[]
[null,"S MomentsSupport 2 = 0 = [(S Loadn * Xn)] - (R Support 1 * Length)"]
[null,"R Support 1 =",{"$f":"(SUM(E147:E161)/C21)","v":263.36551724137934},"lbs"]
[]
[null,"S Forcey = 0 = R Support 2 + R Support 1 - (S Loadn)"]
[null,"R Support 2 =",{"$f":"(SUM(C147:C161))-C164","v":369.13448275862066},"lbs"]
[]
["Dead Load Shear Diagram:"]
[null,"Location","Distance","Load / Reaction","Shear 1","Shear 2"]
[null,"Support 2",0,{"$f":"C167","v":369.13448275862066},{"$f":"0","v":0},{"$f":"E171+C167","v":369.13448275862066},{"$f":"IF(AND(E171>=0,F171>=0),\"+ / +\",IF(AND(E171<=0,F171<=0),\"- / -\",\"+ / -\"))","v":"+ / +"},{"$f":"IF(G171=\"+ / -\",\"Low Point\",\"\")","v":""},{"$f":"IF(H171=\"Low Point\",C171,\" \")","v":" "}]
[null,{"$f":"B120","v":1},10,15,{"$f":"IF(D172>0,F171,\" \")","v":369.13448275862066},{"$f":"IF(D171>0,E172-D172,\" \")","v":354.13448275862066},{"$f":"IF(AND(E172>=0,F172>=0),\"+ / +\",IF(AND(E172<=0,F172<=0),\"- / -\",\"+ / -\"))","v":"+ / +"},{"$f":"IF(G172=\"+ / -\",\"Low Point\",\"\")","v":""},{"$f":"IF(H172=\"Low Point\",C172,\" \")","v":" "}]
[null,2,20,10,{"$f":"F172","v":354.13448275862066},{"$f":"E173-D173","v":344.13448275862066},"+ / +",""," "]
[null,3,30,114,{"$f":"F173","v":344.13448275862066},{"$f":"E174-D174","v":230.13448275862066},{"$f":"IF(AND(E174>=0,F174>=0),\"+ / +\",IF(AND(E174<=0,F174<=0),\"- / -\",\"+ / -\"))","v":"+ / +"},{"$f":"IF(G174=\"+ / -\",\"Low Point\",\"\")","v":""},{"$f":"IF(H174=\"Low Point\",C174,\" \")","v":" "}]
[null,4,36,45,{"$f":"F174","v":230.13448275862066},{"$f":"E175-D175","v":185.13448275862066},"+ / +",{"$f":"IF(G175=\"+ / -\",\"Low Point\",\"\")","v":""}," "]
[null,5,42,106.5,{"$f":"F175","v":185.13448275862066},78.634482758620663,"+ / +",""," "]
[null,6,55,81.5,78.634482758620663,-2.8655172413793366,"+ / -","Low Point",55]
[null,7,65,46.5,-2.8655172413793366,-49.365517241379337,"- / -",""," "]
[null,8,70,96,-49.365517241379337,-145.36551724137934,"- / -",""," "]
[null,9,117,97,-145.36551724137934,-242.36551724137934,"- / -",""," "]
[null,10,124,7,-242.36551724137934,-249.36551724137934,"- / -",""," "]
[null,11,131,7,-249.36551724137934,-256.36551724137934,"- / -",""," "]
[null,12,138,7,-256.36551724137934,-263.36551724137934,"- / -",""," "]
[null,13,145,0,-263.36551724137934,-263.36551724137934,"- / -",""," "]
[null,14,0,0,-263.36551724137934,-263.36551724137934,"- / -",""," "]
[null,15,0,0,-263.36551724137934,-263.36551724137934,"- / -",""," "]
[null,"Support 1",{"$f":"C21","v":145},{"$f":"C164","v":263.36551724137934},{"$f":"F186","v":-263.36551724137934},{"$f":"E187+D187","v":0},"- / -",""," "]
[]
[null,"The Low Point occurs at:",null,{"$f":"MAX(I171:I187)","v":55},"feet from Support 2"]
["Calculation: Sum Moments about Low Point to Determine Horizontal Reaction:"]
[]
[null,"Maximum Allowable Sag:",null,{"$f":"(G21/100)*C21","v":7.25},"feet"]
[null,"Summing Moments about the Low point (Counter-Clockwise Positive):"]
[]
[null,"Location","Distance from Low Point","Load","Moment"]
[null,"Support 2",{"$f":"D189","v":55},{"$f":"D171","v":369.13448275862066},{"$f":"C196*D196","v":20302.396551724138}]
[null,{"$f":"B120","v":1},{"$f":"IF(C172=0,0,IF(C172<$D$189,($D$189-C172),0))","v":45},15,{"$f":"-C197*D197","v":-675}]
[null,2,35,10,{"$f":"-C198*D198","v":-350}]
[null,3,25,114,{"$f":"-C199*D199","v":-2850}]
[null,4,19,45,{"$f":"-C200*D200","v":-855}]
[null,5,13,106.5,{"$f":"-C201*D201","v":-1384.5}]
[null,6,0,81.5,0]
[null,7,0,46.5,0]
[null,8,0,96,0]
[null,9,0,97,0]
[null,10,0,7,0]
[null,11,0,7,0]
[null,12,0,7,0]
[null,13,0,0,0]
[null,14,0,0,0]
[null,15,0,0,0]
[null,"Support 1",0,263.36551724137934,0]
[]
[null,"Determine Horizontal force:"]
[null,"H = ",{"$f":"ABS(SUM(E196:E212)/D192)","v":1956.9512485136743},"lbs"]
[]
["Calculate Actual Length of Cable (Accounting for sag, Dead Load Only):"]
[null,"Fy = Shear 2, calculated above."]
[]
[null,"Location","Fy","xi","Length of Segment"]
[null,"Support 1"]
[null,{"$f":"B120","v":1},{"$f":"E172","v":369.13448275862066},{"$f":"IF(B222<($G$6+1),((C172-C171)),(IF(B222=($G$6+1),(($C$187-C171)),0)))","v":10},{"$f":"SQRT($C$215^2+C222^2)*(D222/$C$215)","v":10.176346438825162}]
[null,2,{"$f":"E173","v":354.13448275862066},10,{"$f":"SQRT($C$215^2+C223^2)*(D223/$C$215)","v":10.162417869419007}]
[null,3,344.13448275862066,10,10.153443013261924]
[null,4,230.13448275862066,6,6.0413457481618114]
[null,5,185.13448275862066,6,6.0267896725689161]
[null,6,78.634482758620663,13,13.010490693888958]
[null,7,-2.8655172413793366,10,10.000010720518979]
[null,8,-49.365517241379337,5,5.0015905902134756]
[null,9,-145.36551724137934,47,47.129488976300166]
[null,10,-242.36551724137934,7,7.0534803003971911]
[null,11,-249.36551724137934,7,7.0566015765301557]
[null,12,-256.36551724137934,7,7.0598102785762062]
[null,13,-263.36551724137934,7,7.0631062873850592]
[null,14,-263.36551724137934,0,0]
[null,15,-263.36551724137934,0,0]
[null,"Support 2",-263.36551724137934,0,0]
[]
[null,null,null,"Total Length =",{"$f":"SUM(E221:E237)","v":145.93492216604704}]
["Wind Loading"]
[]
["Calculate Reactions at each support:"]
[]
[null,"Summing moments about Support 2 (Clockwise moments positive):"]
[]
[null,"Loading","Wind Load","Arm","Moment"]
[null,{"$f":"B120","v":1},{"$f":"E120","v":16.345386666666666},{"$f":"C120","v":10},{"$f":"C247*D247","v":163.45386666666667}]
[null,2,12.690773333333334,20,{"$f":"C248*D248","v":253.81546666666668}]
[null,3,718.87923882666655,30,21566.377164799997]
[null,4,254.73843199999999,36,9170.5835520000001]
[null,5,473.57581994666668,42,19890.184437759999]
[null,6,305.66073685333328,55,16811.340526933331]
[null,7,256.64204799999999,65,16681.733120000001]
[null,8,324.06235818666664,70,22684.365073066663]
[null,9,325.33143551999996,117,38063.777955839993]
[null,10,8.8835413333333335,124,1101.5591253333334]
[null,11,8.8835413333333335,131,1163.7439146666668]
[null,12,8.8835413333333335,138,1225.9287039999999]
[null,13,0,145,0]
[null,14,0,0,0]
[null,15,0,0,0]
[]
[null,"S MomentsSupport 2 = 0 = [(S Loadn * Xn)] - (R Support 1 * Length)"]
[null,"R Support 1 =",{"$f":"(SUM(E247:E261)/C21)","v":1026.0473303981607},"lbs"]
[]
[null,"S Forcey = 0 = R Support 2 + R Support 1 - (S Loadn)"]
[null,"R Support 2 =",{"$f":"(SUM(C247:C261))-C264","v":1688.5295229351718},"lbs"]
[]
["Wind Load Shear Diagram:"]
[null,"Location","Distance","Load / Reaction","Shear 1","Shear 2"]
[null,"Support 2",0,{"$f":"C267","v":1688.5295229351718},{"$f":"0","v":0},{"$f":"E271+C267","v":1688.5295229351718}]
[null,{"$f":"B222","v":1},{"$f":"C120","v":10},{"$f":"E120","v":16.345386666666666},{"$f":"IF(D272>0,F271,\" \")","v":1688.5295229351718},{"$f":"IF(D271>0,E272-D272,\" \")","v":1672.1841362685052}]
[null,2,20,12.690773333333334,{"$f":"F272","v":1672.1841362685052},{"$f":"E273-D273","v":1659.4933629351719}]
[null,3,30,718.87923882666655,1659.4933629351719,940.61412410850539]
[null,4,36,254.73843199999999,940.61412410850539,685.8756921085054]
[null,5,42,473.57581994666668,685.8756921085054,212.29987216183872]
[null,6,55,305.66073685333328,212.29987216183872,-93.360864691494555]
[null,7,65,256.64204799999999,-93.360864691494555,-350.00291269149454]
[null,8,70,324.06235818666664,-350.00291269149454,-674.06527087816119]
[null,9,117,325.33143551999996,-674.06527087816119,-999.39670639816109]
[null,10,124,8.8835413333333335,-999.39670639816109,-1008.2802477314945]
[null,11,131,8.8835413333333335,-1008.2802477314945,-1017.1637890648278]
[null,12,138,8.8835413333333335,-1017.1637890648278,-1026.0473303981612]
[null,13,145,0,-1026.0473303981612,-1026.0473303981612]
[null,14,0,0,-1026.0473303981612,-1026.0473303981612]
[null,15,0,0,-1026.0473303981612,-1026.0473303981612]
[null,"Support 1",{"$f":"C21","v":145},{"$f":"C264","v":1026.0473303981607},{"$f":"F286","v":-1026.0473303981612},{"$f":"E287+D287","v":0}]
[]
[]
["Ice Load"]
[]
["Calculate Reactions at each support:"]
[]
[null,"Summing moments about Support 2 (Clockwise moments positive):"]
[]
[null,"Loading","Ice Load","Arm","Moment"]
[null,{"$f":"B120","v":1},{"$f":"F120","v":12},{"$f":"C120","v":10},{"$f":"C297*D297","v":120}]
[null,2,4,20,{"$f":"C298*D298","v":80}]
[null,3,67.19,30,2015.6999999999998]
[null,4,24.9,36,896.4]
[null,5,93.14,42,3911.88]
[null,6,63.160000000000004,55,3473.8]
[null,7,25.5,65,1657.5]
[null,8,68.960000000000008,70,4827.2000000000007]
[null,9,69.36,117,8115.12]
[null,10,2.8000000000000003,124,347.20000000000005]
[null,11,2.8000000000000003,131,366.8]
[null,12,2.8000000000000003,138,386.40000000000003]
[null,13,0,145,0]
[null,14,0,0,0]
[null,15,0,0,0]
[]
[null,"S MomentsSupport 2 = 0 = [(S Loadn * Xn)] - (R Support 1 * Length)"]
[null,"R Support 1 =",{"$f":"(SUM(E297:E311)/C21)","v":180.67586206896553},"lbs"]
[]
[null,"S Forcey = 0 = R Support 2 + R Support 1 - (S Loadn)"]
[null,"R Support 2 =",{"$f":"(SUM(C297:C311))-C314","v":255.93413793103454},"lbs"]
[]
["Ice Load Shear Diagram:"]
[null,"Location","Distance","Load / Reaction","Shear 1","Shear 2"]
[null,"Support 2",{"$f":"0","v":0},{"$f":"C317","v":255.93413793103454},0,{"$f":"E321+C317","v":255.93413793103454}]
[null,{"$f":"B120","v":1},10,{"$f":"F120","v":12},{"$f":"IF(D322>0,F321,\" \")","v":255.93413793103454},{"$f":"IF(D321>0,E322-D322,\" \")","v":243.93413793103454}]
[null,2,20,4,{"$f":"F322","v":243.93413793103454},{"$f":"E323-D323","v":239.93413793103454}]
[null,3,30,67.19,239.93413793103454,172.74413793103454]
[null,4,36,24.9,172.74413793103454,147.84413793103454]
[null,5,42,93.14,147.84413793103454,54.704137931034538]
[null,6,55,63.160000000000004,54.704137931034538,-8.455862068965466]
[null,7,65,25.5,-8.455862068965466,-33.955862068965466]
[null,8,70,68.960000000000008,-33.955862068965466,-102.91586206896548]
[null,9,117,69.36,-102.91586206896548,-172.27586206896547]
[null,10,124,2.8000000000000003,-172.27586206896547,-175.07586206896548]
[null,11,131,2.8000000000000003,-175.07586206896548,-177.87586206896549]
[null,12,138,2.8000000000000003,-177.87586206896549,-180.6758620689655]
[null,13,145,0,-180.6758620689655,-180.6758620689655]
[null,14,0,0,-180.6758620689655,-180.6758620689655]
[null,15,0,0,-180.6758620689655,-180.6758620689655]
[null,"Support 1",{"$f":"C21","v":145},{"$f":"C314","v":180.67586206896553},{"$f":"IF(D337>0,F336,\" \")","v":-180.6758620689655},{"$f":"E337+D337","v":0}]
[]
["Determine Fx - Group II (Dead + Wind)"]
[]
[null,"Value for Fx:",3039.2446466371084,null,"Fx2 =",{"$f":"C341*C341","v":9237008.0221123211}]
[]
[null,"Location","Fyi","Fyi2","Fzi","Fzi2","xi","Vector Component"]
[null,{"$f":"B120","v":1},{"$f":"F171","v":369.13448275862066},{"$f":"C344*C344","v":136260.26636147441},{"$f":"F271","v":1688.5295229351718},{"$f":"E344*E344","v":2851131.9498236789},{"$f":"D222","v":10},{"$f":"(($F$341+D344+F344)^(0.5))*(G344/$C$341)","v":11.5039800511618}]
[null,2,354.13448275862066,{"$f":"C345*C345","v":125411.2318787158},1672.1841362685052,{"$f":"E345*E345","v":2796199.7855880465},10,{"$f":"(($F$341+D345+F345)^(0.5))*(G345/$C$341)","v":11.472986040424374}]
[null,3,344.13448275862066,118428.54222354338,1659.4933629351719,2753918.2216258864,10,11.449719344506249]
[null,4,230.13448275862066,52961.88015457787,940.61412410850539,884754.93047241075,6,6.2971918752033531]
[null,5,185.13448275862066,34274.776706302015,685.8756921085054,470425.46502532129,6,6.1617368904627297]
[null,6,78.634482758620663,6183.3818787158107,212.29987216183872,45071.235719933065,13,13.036017521687581]
[null,7,-2.8655172413793366,8.2111890606422424,-93.360864691494555,8716.2510559435541,10,10.004721443949842]
[null,8,-49.365517241379337,2436.9542925089204,-350.00291269149454,122502.03889252995,5,5.0337012124454397]
[null,9,-145.36551724137934,21131.133602853752,-674.06527087816119,454363.98940404883,47,48.19453382112183]
[null,10,-242.36551724137934,58741.043947681348,-999.39670639816109,998793.77675949223,7,7.3898549203886814]
[null,11,-249.36551724137934,62183.161189060658,-1008.2802477314945,1016629.0579654839,7,7.3974878831695516]
[null,12,-256.36551724137934,65723.278430439968,-1017.1637890648278,1034622.1737847176,7,7.4052046127737396]
[null,13,-263.36551724137934,69361.395671819279,-1026.0473303981612,1052773.1242171933,7,7.4130048476045252]
[null,14,-263.36551724137934,69361.395671819279,-1026.0473303981612,1052773.1242171933,0,0]
[null,15,-263.36551724137934,69361.395671819279,-1026.0473303981612,1052773.1242171933,0,0]
[null,null,null,null,null,null,"Total:",{"$f":"SUM(H344:H358)","v":152.76014046489968}]
[null,null,"Actual Length :",null,{"$f":"E239","v":145.93492216604704}]
[null,null,"Percentage Difference:",null,{"$f":"(ABS(H359-E360)/E360)*100","v":4.6768917251258015},"%*"]
[]
[null,"* The Percentage Difference should be 0.00 % "]
[]
[]
["Determine Fx - Group III (Dead + Ice + 0.5 · Wind)"]
[null,null,0]
[null,"Value for Fx:",2024.1422013904612,null,"Fx2 =",{"$f":"C368*C368","v":4097151.6514498224}]
[]
[null,"Location","Fyi","Fyi2","Fzi","Fzi2","xi","Vector Component"]
[null,{"$f":"B120","v":1},{"$f":"F171+F321","v":625.06862068965518},{"$f":"C371*C371","v":390710.780570868},{"$f":"0.5*F271","v":844.26476146758591},{"$f":"E371*E371","v":712782.98745591973},{"$f":"D222","v":10},{"$f":"(($F$368+D371+F371)^(0.5))*(G371/$C$368)","v":11.266463205118075}]
[null,2,{"$f":"F172+F322","v":598.06862068965518},{"$f":"C372*C372","v":357686.07505362661},{"$f":"0.5*F272","v":836.0920681342526},{"$f":"E372*E372","v":699049.94639701163},{"$f":"D223","v":10},{"$f":"(($F$368+D372+F372)^(0.5))*(G372/$C$368)","v":11.215701827242835}]
[null,3,584.06862068965518,341136.1536743163,829.74668146758597,688479.5554064716,10,11.186153788864905]
[null,4,402.87862068965524,162311.1830087991,470.3070620542527,221188.73261810269,6,6.2745244678633956]
[null,5,332.9786206896552,110874.76183638528,342.9378460542527,117606.36625633032,6,6.1650280174968559]
[null,6,133.33862068965522,17779.187767419749,106.14993608091936,11267.808929983266,13,13.046000743607935]
[null,7,-11.321379310344803,128.17362948870337,-46.680432345747278,2179.0627639858885,10,10.002815262725919]
[null,8,-83.32137931034481,6942.4522501783558,-175.00145634574727,30625.509723132487,5,5.022870911227602]
[null,9,-248.28137931034482,61643.643312247317,-337.03263543908059,113590.99735101221,47,47.994568872936554]
[null,10,-414.6413793103448,171927.47343638525,-499.69835319908054,249698.44418987306,7,7.3513568120520381]
[null,11,-424.44137931034481,180150.48447086799,-504.14012386574723,254157.26449137097,7,7.3616652800423168]
[null,12,-434.24137931034483,188565.57550535077,-508.58189453241391,258655.54344617939,7,7.3721471435173038]
[null,13,-444.04137931034484,197172.74653983355,-513.0236651990806,263193.28105429834,7,7.3828016639331047]
[null,14,-444.04137931034484,197172.74653983355,-513.0236651990806,263193.28105429834,0,0]
[null,15,-444.04137931034484,197172.74653983355,-513.0236651990806,263193.28105429834,0,0]
[null,null,null,null,null,null,"Total:",{"$f":"SUM(H371:H385)","v":151.64209799662885}]
[null,null,"Actual Length :",null,{"$f":"E239","v":145.93492216604704}]
[null,null,"Percentage Difference:",null,{"$f":"(ABS(H386-E387)/E387)*100","v":3.9107677215794103},"%*"]
[]
[null,"* The Percentage Difference should be 0.00 % "]
[]
[]
[]
["FINAL RESULTS:"]
[]
[null,"Span Wire Present:",{"$f":"Input!I50","v":"YES"}]
[]
["Support Reactions:"]
["Support 1 (Left)",null,null,"Support 2 (Right)",null,null,"Group Load"]
["Fx","Fy","Fz","Fx","Fy","Fz"]
[{"$f":"IF(C396=\"YES\",C215,0)","v":1956.9512485136743},{"$f":"IF(C396=\"YES\",C164,0)","v":263.36551724137934},{"$f":"0","v":0},{"$f":"IF(C396=\"YES\",C215,0)","v":1956.9512485136743},{"$f":"IF(C396=\"YES\",C167,0)","v":369.13448275862066},{"$f":"0","v":0},"Group I","(DL)"]
[{"$f":"IF(C396=\"YES\",C341,0)","v":3039.2446466371084},{"$f":"IF(C396=\"YES\",C164,0)","v":263.36551724137934},{"$f":"IF(C396=\"YES\",C264,0)","v":1026.0473303981607},{"$f":"IF(C396=\"YES\",C341,0)","v":3039.2446466371084},{"$f":"IF(C396=\"YES\",C167,0)","v":369.13448275862066},{"$f":"IF(C396=\"YES\",C267,0)","v":1688.5295229351718},"Group II","(DL + WL)"]
[{"$f":"IF(C396=\"YES\",C368,0)","v":2024.1422013904612},{"$f":"IF(C396=\"YES\",C164+C314,0)","v":444.04137931034484},{"$f":"IF(C396=\"YES\",0.5*C264,0)","v":513.02366519908037},{"$f":"IF(C396=\"YES\",C368,0)","v":2024.1422013904612},{"$f":"IF(C396=\"YES\",C167+C317,0)","v":625.06862068965518},{"$f":"IF(C396=\"YES\",0.5*C267,0)","v":844.26476146758591},"Group III","(DL + IL + 0.5 · WL)"]
[]
["Wire Tension:"]
["Support 1","Support 2","Group Load"]
[{"$f":"SQRT(A401^2+B401^2+C401^2)","v":1974.5935239261391},{"$f":"SQRT(D401^2+E401^2+F401^2)","v":1991.4613868766583},"Group I","(DL)"]
[{"$f":"SQRT(A402^2+B402^2+C402^2)","v":3218.562185510998},{"$f":"SQRT(D402^2+E402^2+F402^2)","v":3496.3409785513591},"Group II","(DL + WL)"]
[{"$f":"SQRT(A403^2+B403^2+C403^2)","v":2134.8343446375306},{"$f":"SQRT(D403^2+E403^2+F403^2)","v":2280.4923633892331},"Group III","(DL + IL + 0.5 · WL)"]

{"sheet":"SW3","index":6,"n_rows":409,"n_cols":9,"rows_kept":409,"cut":false,"hidden":false,"merged":[[162,1,162,5],[2,1,2,8],[4,1,6,4],[20,4,20,5],[25,0,25,8],[48,2,53,2],[218,6,218,7],[398,0,398,2],[398,3,398,5],[398,6,399,8],[405,2,405,4]]}
["Strain Pole Design - SW3 Cable Stringing Tension"]
[]
["Assumptions:","This spreadsheet calculates the tension in strain poles for overhead sign in accordance with the AASHTO Specifications for Structural Supports for Highway Signs, Luminaires and Traffic Signals 4th Edition 2001, including the 2002 and 2003 Interims (Per DM-4), and the Pennsylvania Department of Transportation Criteria for the Design of Traffic Related Structures."]
[]
[null,"Number of assumed concentrated loads on the strain pole cable.  Also must consider concentrated cable loads with a minimum of 5 segments.",null,null,null," "," ",null,"Y"]
[null,null,null,null,null,"=",{"$f":"I51","v":11}]
[null,null,null,null,null,null,null,"M"]
[]
[null,"Support 1 (Left)",null,null,null,null,"X",null,"Support 2 (Right)      "]
[]
[]
[]
[null,null,null,null,null,null,"Loadn"]
[]
[]
[]
[null,null,null,null,null,null,"Xn"]
[]
[null,null,null,null,"Length"]
[]
[null,"Length:",{"$f":"L3_","v":170},"feet","Maximum Allowable Sag:",null,5,"percent"]
[]
[]
["Rank loading ID's from right to left ( Support 2 to Support 1) and calculate wire segment lengths:"]
[]
["The spreadsheet assumes that 3 wire segments are placed before the first point load and 2 wire segments are placed after the last point load.  The number of point loads is calculated by adding the number of point loads input and adding 5 point loads due to the wire segments."]
[]
[null,"Original Rank","Re-rank","Final Rank","Loading ID","Distance"]
[null,{"$f":"IF(F29<>\"N/A\",RANK(F29,$F$29:$F$37,1),\"Exclude\")","v":6},{"$f":"IF(ISNUMBER(B29)=TRUE,B29,MAX($B$29:$B$37)+1)","v":6},{"$f":"RANK(C29,$C$29:$C$37,1)","v":6},"M",{"$f":"IF(Input!E77=\"None\",\"N/A\",Input!F77)","v":129}]
[null,5,{"$f":"IF(ISNUMBER(B30)=TRUE,B30,MAX($B$29:$B$37)+2)","v":5},5,"N",{"$f":"IF(Input!E78=\"None\",\"N/A\",Input!F78)","v":90}]
[null,3,{"$f":"IF(ISNUMBER(B31)=TRUE,B31,MAX($B$29:$B$37)+3)","v":3},3,"O",{"$f":"IF(Input!E79=\"None\",\"N/A\",Input!F79)","v":75}]
[null,2,{"$f":"IF(ISNUMBER(B32)=TRUE,B32,MAX($B$29:$B$37)+4)","v":2},2,"P",{"$f":"IF(Input!E80=\"None\",\"N/A\",Input!F80)","v":55}]
[null,4,{"$f":"IF(ISNUMBER(B33)=TRUE,B33,MAX($B$29:$B$37)+5)","v":4},4,"R",{"$f":"IF(Input!D81=\"None\",\"N/A\",Input!F81)","v":83}]
[null,"Exclude",{"$f":"IF(ISNUMBER(B34)=TRUE,B34,MAX($B$29:$B$37)+6)","v":12},7,"S",{"$f":"IF(Input!D82=\"None\",\"N/A\",Input!F82)","v":"N/A"}]
[null,"Exclude",{"$f":"IF(ISNUMBER(B35)=TRUE,B35,MAX($B$29:$B$37)+7)","v":13},8,"T",{"$f":"IF(Input!D83=\"None\",\"N/A\",Input!F83)","v":"N/A"}]
[null,"Exclude",{"$f":"IF(ISNUMBER(B36)=TRUE,B36,MAX($B$29:$B$37)+8)","v":14},9,"U",{"$f":"IF(Input!D84=\"None\",\"N/A\",Input!F84)","v":"N/A"}]
[null,1,{"$f":"IF(ISNUMBER(B37)=TRUE,B37,MAX($B$29:$B$37)+9)","v":1},1,"Y",{"$f":"IF(Input!D85=\"None\",\"N/A\",Input!F85)","v":27}]
[]
[null,null,"Rank","Loading ID","Distance","Count"]
[null,null,1,{"$f":"VLOOKUP(C40,$D$29:$F$37,2,0)","v":"Y"},{"$f":"VLOOKUP(C40,$D$29:$F$37,3,0)","v":27},{"$f":"IF(E40<>\"N/A\",1,0)","v":1}]
[null,null,2,"P",55,1]
[null,null,3,"O",75,1]
[null,null,4,"R",83,1]
[null,null,5,"N",90,1]
[null,null,6,"M",129,1]
[null,null,7,"S","N/A",0]
[null,null,8,"T","N/A",0]
[null,null,9,"U","N/A",0]
[null,null,"Wire Sections","W1",{"$f":"MIN(E40:E48)/3","v":9}]
[null,null,null,"W2",{"$f":"MIN(E40:E48)/3+E49","v":18},null,null,"Number of Point Loads:",{"$f":"SUM(F40:F48)","v":6}]
[null,null,null,"W3",{"$f":"(C21-MAX(E40:E48))/4+MAX(E40:E48)","v":139.25},null,null,"No. of Point Loads w/ Wire Segments:",{"$f":"I50+5","v":11}]
[null,null,null,"W4",{"$f":"(C21-MAX(E40:E48))/4+E51","v":149.5}]
[null,null,null,"W5",{"$f":"(C21-MAX(E40:E48))/4+E52","v":159.75}]
[null,null,null,"W6",{"$f":"C21","v":170}]
[]
[]
["Rank ID's and Wire Segments from right to left ( Support 2 to Support 1) and calculate loading:"]
[]
[null,null,"Original Rank With Wire","Re-rank","Final Rank","Loading ID","Distance"]
[null,null,{"$f":"IF(E40<>\"N/A\",RANK(E40,$E$40:$E$54,1),\"Exclude\")","v":3},{"$f":"IF(ISNUMBER(C60)=TRUE,C60,MAX($C$60:$C$74)+1)","v":3},{"$f":"RANK(D60,$D$60:$D$74,1)","v":3},{"$f":"D40","v":"Y"},27]
[null,null,4,{"$f":"IF(ISNUMBER(C61)=TRUE,C61,MAX($C$60:$C$74)+2)","v":4},4,"P",55]
[null,null,5,{"$f":"IF(ISNUMBER(C62)=TRUE,C62,MAX($C$60:$C$74)+3)","v":5},5,"O",75]
[null,null,6,{"$f":"IF(ISNUMBER(C63)=TRUE,C63,MAX($C$60:$C$74)+4)","v":6},6,"R",83]
[null,null,7,{"$f":"IF(ISNUMBER(C64)=TRUE,C64,MAX($C$60:$C$74)+5)","v":7},7,"N",90]
[null,null,8,{"$f":"IF(ISNUMBER(C65)=TRUE,C65,MAX($C$60:$C$74)+6)","v":8},8,"M",129]
[null,null,"Exclude",{"$f":"IF(ISNUMBER(C66)=TRUE,C66,MAX($C$60:$C$74)+7)","v":19},13,"S","N/A"]
[null,null,"Exclude",{"$f":"IF(ISNUMBER(C67)=TRUE,C67,MAX($C$60:$C$74)+8)","v":20},14,"T","N/A"]
[null,null,"Exclude",{"$f":"IF(ISNUMBER(C68)=TRUE,C68,MAX($C$60:$C$74)+9)","v":21},15,"U","N/A"]
[null,null,1,{"$f":"IF(ISNUMBER(C69)=TRUE,C69,MAX($C$60:$C$74)+10)","v":1},1,"W1",9]
[null,null,2,{"$f":"IF(ISNUMBER(C70)=TRUE,C70,MAX($C$60:$C$74)+11)","v":2},2,"W2",18]
[null,null,9,{"$f":"IF(ISNUMBER(C71)=TRUE,C71,MAX($C$60:$C$74)+12)","v":9},9,"W3",139.25]
[null,null,10,{"$f":"IF(ISNUMBER(C72)=TRUE,C72,MAX($C$60:$C$74)+13)","v":10},10,"W4",149.5]
[null,null,11,{"$f":"IF(ISNUMBER(C73)=TRUE,C73,MAX($C$60:$C$74)+14)","v":11},11,"W5",159.75]
[null,null,12,{"$f":"IF(ISNUMBER(C74)=TRUE,C74,MAX($C$60:$C$74)+15)","v":12},12,"W6",170]
[]
[null,"Final Rank","Loading ID","Distance","Distance for Table","Load description","Signal Config/Sign Size/Wire Dia"]
[null,1,{"$f":"VLOOKUP(B77,$E$60:$G$74,2,0)","v":"W1"},{"$f":"VLOOKUP(B77,$E$60:$G$74,3,0)","v":9},{"$f":"IF(ISNUMBER(D77),D77,0)","v":9},{"$f":"IF(OR(C77=$D$49,C77=$D$50,C77=$D$51,C77=$D$52,C77=$D$53,C77=$D$54),\"Wire\",VLOOKUP(C77,Input!$B$77:$C$85,2,0))","v":"Wire"},{"$f":"IF(F77=\"Signal\",VLOOKUP(C77,Input!$B$77:$I$85,4,0),IF(F77=\"Sign\",VLOOKUP(C77,Input!$B$77:$I$85,3,0),SW3_Wire_Dia))","v":"0.5\""}]
[null,2,"W2",18,18,{"$f":"IF(OR(C78=$D$49,C78=$D$50,C78=$D$51,C78=$D$52,C78=$D$53,C78=$D$54),\"Wire\",VLOOKUP(C78,Input!$B$77:$C$85,2,0))","v":"Wire"},{"$f":"IF(F78=\"Signal\",VLOOKUP(C78,Input!$B$77:$I$85,4,0),IF(F78=\"Sign\",VLOOKUP(C78,Input!$B$77:$I$85,3,0),SW3_Wire_Dia))","v":"0.5\""}]
[null,3,"Y",27,27,{"$f":"IF(OR(C79=$D$49,C79=$D$50,C79=$D$51,C79=$D$52,C79=$D$53,C79=$D$54),\"Wire\",VLOOKUP(C79,Input!$B$77:$C$85,2,0))","v":"Sign"},{"$f":"IF(F79=\"Signal\",VLOOKUP(C79,Input!$B$77:$I$85,4,0),IF(F79=\"Sign\",VLOOKUP(C79,Input!$B$77:$I$85,3,0),SW3_Wire_Dia))","v":"96\" x 32\""}]
[null,4,"P",55,55,{"$f":"IF(OR(C80=$D$49,C80=$D$50,C80=$D$51,C80=$D$52,C80=$D$53,C80=$D$54),\"Wire\",VLOOKUP(C80,Input!$B$77:$C$85,2,0))","v":"Signal"},{"$f":"IF(F80=\"Signal\",VLOOKUP(C80,Input!$B$77:$I$85,4,0),IF(F80=\"Sign\",VLOOKUP(C80,Input!$B$77:$I$85,3,0),SW3_Wire_Dia))","v":"A-3"}]
[null,5,"O",75,75,{"$f":"IF(OR(C81=$D$49,C81=$D$50,C81=$D$51,C81=$D$52,C81=$D$53,C81=$D$54),\"Wire\",VLOOKUP(C81,Input!$B$77:$C$85,2,0))","v":"Signal"},{"$f":"IF(F81=\"Signal\",VLOOKUP(C81,Input!$B$77:$I$85,4,0),IF(F81=\"Sign\",VLOOKUP(C81,Input!$B$77:$I$85,3,0),SW3_Wire_Dia))","v":"A-3"}]
[null,6,"R",83,83,{"$f":"IF(OR(C82=$D$49,C82=$D$50,C82=$D$51,C82=$D$52,C82=$D$53,C82=$D$54),\"Wire\",VLOOKUP(C82,Input!$B$77:$C$85,2,0))","v":"Sign"},{"$f":"IF(F82=\"Signal\",VLOOKUP(C82,Input!$B$77:$I$85,4,0),IF(F82=\"Sign\",VLOOKUP(C82,Input!$B$77:$I$85,3,0),SW3_Wire_Dia))","v":"30\" x 36\""}]
[null,7,"N",90,90,{"$f":"IF(OR(C83=$D$49,C83=$D$50,C83=$D$51,C83=$D$52,C83=$D$53,C83=$D$54),\"Wire\",VLOOKUP(C83,Input!$B$77:$C$85,2,0))","v":"Signal"},{"$f":"IF(F83=\"Signal\",VLOOKUP(C83,Input!$B$77:$I$85,4,0),IF(F83=\"Sign\",VLOOKUP(C83,Input!$B$77:$I$85,3,0),SW3_Wire_Dia))","v":"A-3"}]
[null,8,"M",129,129,{"$f":"IF(OR(C84=$D$49,C84=$D$50,C84=$D$51,C84=$D$52,C84=$D$53,C84=$D$54),\"Wire\",VLOOKUP(C84,Input!$B$77:$C$85,2,0))","v":"Signal"},{"$f":"IF(F84=\"Signal\",VLOOKUP(C84,Input!$B$77:$I$85,4,0),IF(F84=\"Sign\",VLOOKUP(C84,Input!$B$77:$I$85,3,0),SW3_Wire_Dia))","v":"A-3"}]
[null,9,"W3",139.25,139.25,{"$f":"IF(OR(C85=$D$49,C85=$D$50,C85=$D$51,C85=$D$52,C85=$D$53,C85=$D$54),\"Wire\",VLOOKUP(C85,Input!$B$77:$C$85,2,0))","v":"Wire"},{"$f":"IF(F85=\"Signal\",VLOOKUP(C85,Input!$B$77:$I$85,4,0),IF(F85=\"Sign\",VLOOKUP(C85,Input!$B$77:$I$85,3,0),SW3_Wire_Dia))","v":"0.5\""}]
[null,10,"W4",149.5,149.5,{"$f":"IF(OR(C86=$D$49,C86=$D$50,C86=$D$51,C86=$D$52,C86=$D$53,C86=$D$54),\"Wire\",VLOOKUP(C86,Input!$B$77:$C$85,2,0))","v":"Wire"},{"$f":"IF(F86=\"Signal\",VLOOKUP(C86,Input!$B$77:$I$85,4,0),IF(F86=\"Sign\",VLOOKUP(C86,Input!$B$77:$I$85,3,0),SW3_Wire_Dia))","v":"0.5\""}]
[null,11,"W5",159.75,159.75,{"$f":"IF(OR(C87=$D$49,C87=$D$50,C87=$D$51,C87=$D$52,C87=$D$53,C87=$D$54),\"Wire\",VLOOKUP(C87,Input!$B$77:$C$85,2,0))","v":"Wire"},{"$f":"IF(F87=\"Signal\",VLOOKUP(C87,Input!$B$77:$I$85,4,0),IF(F87=\"Sign\",VLOOKUP(C87,Input!$B$77:$I$85,3,0),SW3_Wire_Dia))","v":"0.5\""}]
[null,12,"W6",170,170,{"$f":"IF(OR(C88=$D$49,C88=$D$50,C88=$D$51,C88=$D$52,C88=$D$53,C88=$D$54),\"Wire\",VLOOKUP(C88,Input!$B$77:$C$85,2,0))","v":"Wire"},{"$f":"IF(F88=\"Signal\",VLOOKUP(C88,Input!$B$77:$I$85,4,0),IF(F88=\"Sign\",VLOOKUP(C88,Input!$B$77:$I$85,3,0),SW3_Wire_Dia))","v":"0.5\""}]
[null,13,"S","N/A",0,{"$f":"IF(OR(C89=$D$49,C89=$D$50,C89=$D$51,C89=$D$52,C89=$D$53,C89=$D$54),\"Wire\",VLOOKUP(C89,Input!$B$77:$C$85,2,0))","v":"Sign"},{"$f":"IF(F89=\"Signal\",VLOOKUP(C89,Input!$B$77:$I$85,4,0),IF(F89=\"Sign\",VLOOKUP(C89,Input!$B$77:$I$85,3,0),SW3_Wire_Dia))","v":"None"}]
[null,14,"T","N/A",0,{"$f":"IF(OR(C90=$D$49,C90=$D$50,C90=$D$51,C90=$D$52,C90=$D$53,C90=$D$54),\"Wire\",VLOOKUP(C90,Input!$B$77:$C$85,2,0))","v":"Sign"},{"$f":"IF(F90=\"Signal\",VLOOKUP(C90,Input!$B$77:$I$85,4,0),IF(F90=\"Sign\",VLOOKUP(C90,Input!$B$77:$I$85,3,0),SW3_Wire_Dia))","v":"None"}]
[null,15,"U","N/A",0,{"$f":"IF(OR(C91=$D$49,C91=$D$50,C91=$D$51,C91=$D$52,C91=$D$53,C91=$D$54),\"Wire\",VLOOKUP(C91,Input!$B$77:$C$85,2,0))","v":"Sign"},{"$f":"IF(F91=\"Signal\",VLOOKUP(C91,Input!$B$77:$I$85,4,0),IF(F91=\"Sign\",VLOOKUP(C91,Input!$B$77:$I$85,3,0),SW3_Wire_Dia))","v":"None"}]
[]
["Calculate Loads:"]
[]
[null,"Wire Weights:"]
[null,null,"Wire Weight =",{"$f":"VLOOKUP(SW1_Wire_Dia,'Pick Lists & Data'!A29:B33,2,0)","v":1},"lb/ft"]
[null,null,"Wire Wind Load =",{"$f":"VLOOKUP(SW1_Wire_Dia,'Pick Lists & Data'!A29:L33,10,0)","v":1.2690773333333334},"lb/ft"]
[null,null,"Wire Ice Load =",{"$f":"VLOOKUP(SW1_Wire_Dia,'Pick Lists & Data'!A29:L33,12,0)","v":0.4},"lb/ft"]
[]
["Loading Final Rank","Distance for Table","Signal Config/Sign Size/Wire Dia","Wire Segment Dead Load","Signal/Sign Dead Load","Wire Segment Wind Load","Signal/Sign Wind Load","Wire Segment Ice Load","Signal/Sign Ice Load"]
[{"$f":"B77","v":1},{"$f":"E77","v":9},{"$f":"G77","v":"0.5\""},{"$f":"$D$77+($D$78-$D$77)*0.5*$D$96","v":13.5},{"$f":"IF($F77=\"Wire\",0,IF($F77=\"Sign\",VLOOKUP($G77,'Pick Lists & Data'!$A$39:$G$43,2,0),VLOOKUP($G77,'Pick Lists & Data'!$A$11:$H$25,2,0)))","v":0},{"$f":"$D$77+($D$78-$D$77)*0.5*$D$97","v":14.710848},{"$f":"IF($F77=\"Wire\",0,IF($F77=\"Sign\",VLOOKUP($G77,'Pick Lists & Data'!$A$39:$G$43,6,0),VLOOKUP($G77,'Pick Lists & Data'!$A$11:$H$25,6,0)))","v":0},{"$f":"$D$77+($D$78-$D$77)*0.5*$D$98","v":10.8},{"$f":"IF($F77=\"Wire\",0,IF($F77=\"Sign\",VLOOKUP($G77,'Pick Lists & Data'!$A$39:$G$43,7,0),VLOOKUP($G77,'Pick Lists & Data'!$A$11:$H$25,8,0)))","v":0}]
[2,18,"0.5\"",{"$f":"IF($E79=0,0,IF($E78<$C$21,(($E78-$E77)*0.5+($E79-$E78)*0.5)*$D$96,(($E78-$E77)*0.5+($E79-E$78))*$D$96))","v":9},{"$f":"IF(F78=\"Wire\",0,IF(F78=\"Sign\",VLOOKUP(G78,'Pick Lists & Data'!$A$39:$G$43,2,0),VLOOKUP(G78,'Pick Lists & Data'!$A$11:$H$25,2,0)))","v":0},{"$f":"IF($E79=0,0,IF($E78<$C$21,(($E78-$E77)*0.5+($E79-$E78)*0.5)*$D$97,(($E78-$E77)*0.5+($E79-G$78))*$D$97))","v":11.421696000000001},{"$f":"IF($F78=\"Wire\",0,IF($F78=\"Sign\",VLOOKUP($G78,'Pick Lists & Data'!$A$39:$G$43,6,0),VLOOKUP($G78,'Pick Lists & Data'!$A$11:$H$25,6,0)))","v":0},{"$f":"IF($E79=0,0,IF($E78<$C$21,(($E78-$E77)*0.5+($E79-$E78)*0.5)*$D$98,(($E78-$E77)*0.5+($E79-E$102))*$D$98))","v":3.6},{"$f":"IF($F78=\"Wire\",0,IF($F78=\"Sign\",VLOOKUP($G78,'Pick Lists & Data'!$A$39:$G$43,7,0),VLOOKUP($G78,'Pick Lists & Data'!$A$11:$H$25,8,0)))","v":0}]
[3,27,"96\" x 32\"",18.5,{"$f":"IF(F79=\"Wire\",0,IF(F79=\"Sign\",VLOOKUP(G79,'Pick Lists & Data'!$A$39:$G$43,2,0),VLOOKUP(G79,'Pick Lists & Data'!$A$11:$H$25,2,0)))","v":106},23.477930666666669,{"$f":"IF($F79=\"Wire\",0,IF($F79=\"Sign\",VLOOKUP($G79,'Pick Lists & Data'!$A$39:$G$43,6,0),VLOOKUP($G79,'Pick Lists & Data'!$A$11:$H$25,6,0)))","v":708.72662015999992},7.4,{"$f":"IF($F79=\"Wire\",0,IF($F79=\"Sign\",VLOOKUP($G79,'Pick Lists & Data'!$A$39:$G$43,7,0),VLOOKUP($G79,'Pick Lists & Data'!$A$11:$H$25,8,0)))","v":63.989999999999995}]
[4,55,"A-3",24,{"$f":"IF(F80=\"Wire\",0,IF(F80=\"Sign\",VLOOKUP(G80,'Pick Lists & Data'!$A$39:$G$43,2,0),VLOOKUP(G80,'Pick Lists & Data'!$A$11:$H$25,2,0)))","v":70},30.457856,{"$f":"IF($F80=\"Wire\",0,IF($F80=\"Sign\",VLOOKUP($G80,'Pick Lists & Data'!$A$39:$G$43,6,0),VLOOKUP($G80,'Pick Lists & Data'!$A$11:$H$25,6,0)))","v":291.06634751999997},9.6000000000000014,{"$f":"IF($F80=\"Wire\",0,IF($F80=\"Sign\",VLOOKUP($G80,'Pick Lists & Data'!$A$39:$G$43,7,0),VLOOKUP($G80,'Pick Lists & Data'!$A$11:$H$25,8,0)))","v":58.56}]
[5,75,"A-3",14,{"$f":"IF(F81=\"Wire\",0,IF(F81=\"Sign\",VLOOKUP(G81,'Pick Lists & Data'!$A$39:$G$43,2,0),VLOOKUP(G81,'Pick Lists & Data'!$A$11:$H$25,2,0)))","v":70},17.767082666666667,{"$f":"IF($F81=\"Wire\",0,IF($F81=\"Sign\",VLOOKUP($G81,'Pick Lists & Data'!$A$39:$G$43,6,0),VLOOKUP($G81,'Pick Lists & Data'!$A$11:$H$25,6,0)))","v":291.06634751999997},5.6000000000000005,{"$f":"IF($F81=\"Wire\",0,IF($F81=\"Sign\",VLOOKUP($G81,'Pick Lists & Data'!$A$39:$G$43,7,0),VLOOKUP($G81,'Pick Lists & Data'!$A$11:$H$25,8,0)))","v":58.56}]
[6,83,"30\" x 36\"",7.5,{"$f":"IF(F82=\"Wire\",0,IF(F82=\"Sign\",VLOOKUP(G82,'Pick Lists & Data'!$A$39:$G$43,2,0),VLOOKUP(G82,'Pick Lists & Data'!$A$11:$H$25,2,0)))","v":39},9.5180800000000012,{"$f":"IF($F82=\"Wire\",0,IF($F82=\"Sign\",VLOOKUP($G82,'Pick Lists & Data'!$A$39:$G$43,6,0),VLOOKUP($G82,'Pick Lists & Data'!$A$11:$H$25,6,0)))","v":247.12396799999999},3,{"$f":"IF($F82=\"Wire\",0,IF($F82=\"Sign\",VLOOKUP($G82,'Pick Lists & Data'!$A$39:$G$43,7,0),VLOOKUP($G82,'Pick Lists & Data'!$A$11:$H$25,8,0)))","v":22.5}]
[7,90,"A-3",23,{"$f":"IF(F83=\"Wire\",0,IF(F83=\"Sign\",VLOOKUP(G83,'Pick Lists & Data'!$A$39:$G$43,2,0),VLOOKUP(G83,'Pick Lists & Data'!$A$11:$H$25,2,0)))","v":70},29.188778666666668,{"$f":"IF($F83=\"Wire\",0,IF($F83=\"Sign\",VLOOKUP($G83,'Pick Lists & Data'!$A$39:$G$43,6,0),VLOOKUP($G83,'Pick Lists & Data'!$A$11:$H$25,6,0)))","v":291.06634751999997},9.2000000000000011,{"$f":"IF($F83=\"Wire\",0,IF($F83=\"Sign\",VLOOKUP($G83,'Pick Lists & Data'!$A$39:$G$43,7,0),VLOOKUP($G83,'Pick Lists & Data'!$A$11:$H$25,8,0)))","v":58.56}]
[8,129,"A-3",24.625,{"$f":"IF(F84=\"Wire\",0,IF(F84=\"Sign\",VLOOKUP(G84,'Pick Lists & Data'!$A$39:$G$43,2,0),VLOOKUP(G84,'Pick Lists & Data'!$A$11:$H$25,2,0)))","v":70},31.251029333333335,{"$f":"IF($F84=\"Wire\",0,IF($F84=\"Sign\",VLOOKUP($G84,'Pick Lists & Data'!$A$39:$G$43,6,0),VLOOKUP($G84,'Pick Lists & Data'!$A$11:$H$25,6,0)))","v":291.06634751999997},9.8500000000000014,{"$f":"IF($F84=\"Wire\",0,IF($F84=\"Sign\",VLOOKUP($G84,'Pick Lists & Data'!$A$39:$G$43,7,0),VLOOKUP($G84,'Pick Lists & Data'!$A$11:$H$25,8,0)))","v":58.56}]
[9,139.25,"0.5\"",10.25,{"$f":"IF(F85=\"Wire\",0,IF(F85=\"Sign\",VLOOKUP(G85,'Pick Lists & Data'!$A$39:$G$43,2,0),VLOOKUP(G85,'Pick Lists & Data'!$A$11:$H$25,2,0)))","v":0},13.008042666666666,{"$f":"IF($F85=\"Wire\",0,IF($F85=\"Sign\",VLOOKUP($G85,'Pick Lists & Data'!$A$39:$G$43,6,0),VLOOKUP($G85,'Pick Lists & Data'!$A$11:$H$25,6,0)))","v":0},4.1000000000000005,{"$f":"IF($F85=\"Wire\",0,IF($F85=\"Sign\",VLOOKUP($G85,'Pick Lists & Data'!$A$39:$G$43,7,0),VLOOKUP($G85,'Pick Lists & Data'!$A$11:$H$25,8,0)))","v":0}]
[10,149.5,"0.5\"",10.25,{"$f":"IF(F86=\"Wire\",0,IF(F86=\"Sign\",VLOOKUP(G86,'Pick Lists & Data'!$A$39:$G$43,2,0),VLOOKUP(G86,'Pick Lists & Data'!$A$11:$H$25,2,0)))","v":0},13.008042666666666,{"$f":"IF($F86=\"Wire\",0,IF($F86=\"Sign\",VLOOKUP($G86,'Pick Lists & Data'!$A$39:$G$43,6,0),VLOOKUP($G86,'Pick Lists & Data'!$A$11:$H$25,6,0)))","v":0},4.1000000000000005,{"$f":"IF($F86=\"Wire\",0,IF($F86=\"Sign\",VLOOKUP($G86,'Pick Lists & Data'!$A$39:$G$43,7,0),VLOOKUP($G86,'Pick Lists & Data'!$A$11:$H$25,8,0)))","v":0}]
[11,159.75,"0.5\"",10.25,{"$f":"IF(F87=\"Wire\",0,IF(F87=\"Sign\",VLOOKUP(G87,'Pick Lists & Data'!$A$39:$G$43,2,0),VLOOKUP(G87,'Pick Lists & Data'!$A$11:$H$25,2,0)))","v":0},13.008042666666666,{"$f":"IF($F87=\"Wire\",0,IF($F87=\"Sign\",VLOOKUP($G87,'Pick Lists & Data'!$A$39:$G$43,6,0),VLOOKUP($G87,'Pick Lists & Data'!$A$11:$H$25,6,0)))","v":0},4.1000000000000005,{"$f":"IF($F87=\"Wire\",0,IF($F87=\"Sign\",VLOOKUP($G87,'Pick Lists & Data'!$A$39:$G$43,7,0),VLOOKUP($G87,'Pick Lists & Data'!$A$11:$H$25,8,0)))","v":0}]
[12,170,"0.5\"",0,{"$f":"IF(F88=\"Wire\",0,IF(F88=\"Sign\",VLOOKUP(G88,'Pick Lists & Data'!$A$39:$G$43,2,0),VLOOKUP(G88,'Pick Lists & Data'!$A$11:$H$25,2,0)))","v":0},0,{"$f":"IF($F88=\"Wire\",0,IF($F88=\"Sign\",VLOOKUP($G88,'Pick Lists & Data'!$A$39:$G$43,6,0),VLOOKUP($G88,'Pick Lists & Data'!$A$11:$H$25,6,0)))","v":0},0,{"$f":"IF($F88=\"Wire\",0,IF($F88=\"Sign\",VLOOKUP($G88,'Pick Lists & Data'!$A$39:$G$43,7,0),VLOOKUP($G88,'Pick Lists & Data'!$A$11:$H$25,8,0)))","v":0}]
[13,0,"None",0,{"$f":"IF(F89=\"Wire\",0,IF(F89=\"Sign\",VLOOKUP(G89,'Pick Lists & Data'!$A$39:$G$43,2,0),VLOOKUP(G89,'Pick Lists & Data'!$A$11:$H$25,2,0)))","v":0},0,{"$f":"IF($F89=\"Wire\",0,IF($F89=\"Sign\",VLOOKUP($G89,'Pick Lists & Data'!$A$39:$G$43,6,0),VLOOKUP($G89,'Pick Lists & Data'!$A$11:$H$25,6,0)))","v":0},0,{"$f":"IF($F89=\"Wire\",0,IF($F89=\"Sign\",VLOOKUP($G89,'Pick Lists & Data'!$A$39:$G$43,7,0),VLOOKUP($G89,'Pick Lists & Data'!$A$11:$H$25,8,0)))","v":0}]
[14,0,"None",0,{"$f":"IF(F90=\"Wire\",0,IF(F90=\"Sign\",VLOOKUP(G90,'Pick Lists & Data'!$A$39:$G$43,2,0),VLOOKUP(G90,'Pick Lists & Data'!$A$11:$H$25,2,0)))","v":0},0,{"$f":"IF($F90=\"Wire\",0,IF($F90=\"Sign\",VLOOKUP($G90,'Pick Lists & Data'!$A$39:$G$43,6,0),VLOOKUP($G90,'Pick Lists & Data'!$A$11:$H$25,6,0)))","v":0},0,{"$f":"IF($F90=\"Wire\",0,IF($F90=\"Sign\",VLOOKUP($G90,'Pick Lists & Data'!$A$39:$G$43,7,0),VLOOKUP($G90,'Pick Lists & Data'!$A$11:$H$25,8,0)))","v":0}]
[15,0,"None",{"$f":"IF($T162=0,0,IF($E91<$C$21,(($E91-$E90)*0.5+($T162-$E91)*0.5)*$D$96,(($E91-$E90)*0.5+($T162-E$78))*$D$96))","v":0},{"$f":"IF(F91=\"Wire\",0,IF(F91=\"Sign\",VLOOKUP(G91,'Pick Lists & Data'!$A$39:$G$43,2,0),VLOOKUP(G91,'Pick Lists & Data'!$A$11:$H$25,2,0)))","v":0},{"$f":"IF($T162=0,0,IF($E91<$C$21,(($E91-$E90)*0.5+($T162-$E91)*0.5)*$D$97,(($E91-$E90)*0.5+($T162-G$78))*$D$97))","v":0},{"$f":"IF($F91=\"Wire\",0,IF($F91=\"Sign\",VLOOKUP($G91,'Pick Lists & Data'!$A$39:$G$43,6,0),VLOOKUP($G91,'Pick Lists & Data'!$A$11:$H$25,6,0)))","v":0},{"$f":"IF($T162=0,0,IF($E91<$C$21,(($E91-$E90)*0.5+($T162-$E91)*0.5)*$D$98,(($E91-$E90)*0.5+($T162-E$102))*$D$98))","v":0},{"$f":"IF($F91=\"Wire\",0,IF($F91=\"Sign\",VLOOKUP($G91,'Pick Lists & Data'!$A$39:$G$43,7,0),VLOOKUP($G91,'Pick Lists & Data'!$A$11:$H$25,8,0)))","v":0}]
[]
["Place Distances and Loads into table for span wire analysis"]
[]
[null,"Loading Final Rank","Distance (Xn)","Dead Load","Wind Load","Ice Load","Load Description","Signal Config/Sign Size/Wire Diameter"]
[null,1,{"$f":"B101","v":9},{"$f":"SUM(D101:E101)","v":13.5},{"$f":"SUM(F101:G101)","v":14.710848},{"$f":"SUM(H101:I101)","v":10.8},{"$f":"F77","v":"Wire"},{"$f":"C101","v":"0.5\""}]
[null,2,{"$f":"B102","v":18},{"$f":"SUM(D102:E102)","v":9},{"$f":"SUM(F102:G102)","v":11.421696000000001},{"$f":"SUM(H102:I102)","v":3.6},"Wire",{"$f":"C102","v":"0.5\""}]
[null,3,27,124.5,732.2045508266666,71.39,"Sign","96\" x 32\""]
[null,4,55,94,321.52420351999996,68.16,"Signal","A-3"]
[null,5,75,84,308.83343018666665,64.16,"Signal","A-3"]
[null,6,83,46.5,256.64204799999999,25.5,"Sign","30\" x 36\""]
[null,7,90,93,320.25512618666664,67.760000000000005,"Signal","A-3"]
[null,8,129,94.625,322.31737685333331,68.41,"Signal","A-3"]
[null,9,139.25,10.25,13.008042666666666,4.1000000000000005,"Wire","0.5\""]
[null,10,149.5,10.25,13.008042666666666,4.1000000000000005,"Wire","0.5\""]
[null,11,159.75,10.25,13.008042666666666,4.1000000000000005,"Wire","0.5\""]
[null,12,170,0,0,0,"Wire","0.5\""]
[null,13,0,0,0,0,"Sign","None"]
[null,14,0,0,0,0,"Sign","None"]
[null,15,0,0,0,0,"Sign","None"]
[null,null,null,{"$f":"SUM(D120:D134)","v":589.875},{"$f":"SUM(E120:E134)","v":2326.9334075733336}]
[]
[null,"* Distances MUST be entered in order, starting with the load closest to Support 1 and moving"]
[null,"right towards Support 2.  If all 14 loads are not used, a \"null distance\" and a \"null load\" must be "]
[null,"assigned to the worksheet cell (ie. Enter a zero for each null value.)"]
[]
["Dead Load (Group I Loading, also used for Groups II and III)"]
[]
["Calculate Dead Load Reactions:"]
[null,"Summing moments about Support 2 (Counter clockwise-moments positive):"]
[]
[null,"Loading","Dead Load","Arm","Moment"]
[null,{"$f":"B120","v":1},{"$f":"D120","v":13.5},{"$f":"C120","v":9},{"$f":"C147*D147","v":121.5}]
[null,2,9,18,162]
[null,3,124.5,27,3361.5]
[null,4,94,55,5170]
[null,5,84,75,6300]
[null,6,46.5,83,3859.5]
[null,7,93,90,8370]
[null,8,94.625,129,12206.625]
[null,9,10.25,139.25,1427.3125]
[null,10,10.25,149.5,1532.375]
[null,11,10.25,159.75,1637.4375]
[null,12,0,170,0]
[null,13,0,0,0]
[null,14,0,0,0]
[null,15,0,0,0]
[]
[null,"S MomentsSupport 2 = 0 = [(S Loadn * Xn)] - (R Support 1 * Length)"]
[null,"R Support 1 =",{"$f":"(SUM(E147:E161)/C21)","v":259.69558823529411},"lbs"]
[]
[null,"S Forcey = 0 = R Support 2 + R Support 1 - (S Loadn)"]
[null,"R Support 2 =",{"$f":"(SUM(C147:C161))-C164","v":330.17941176470589},"lbs"]
[]
["Dead Load Shear Diagram:"]
[null,"Location","Distance","Load / Reaction","Shear 1","Shear 2"]
[null,"Support 2",0,{"$f":"C167","v":330.17941176470589},{"$f":"0","v":0},{"$f":"E171+C167","v":330.17941176470589},{"$f":"IF(AND(E171>=0,F171>=0),\"+ / +\",IF(AND(E171<=0,F171<=0),\"- / -\",\"+ / -\"))","v":"+ / +"},{"$f":"IF(G171=\"+ / -\",\"Low Point\",\"\")","v":""},{"$f":"IF(H171=\"Low Point\",C171,\" \")","v":" "}]
[null,{"$f":"B120","v":1},9,13.5,{"$f":"IF(D172>0,F171,\" \")","v":330.17941176470589},{"$f":"IF(D171>0,E172-D172,\" \")","v":316.67941176470589},{"$f":"IF(AND(E172>=0,F172>=0),\"+ / +\",IF(AND(E172<=0,F172<=0),\"- / -\",\"+ / -\"))","v":"+ / +"},{"$f":"IF(G172=\"+ / -\",\"Low Point\",\"\")","v":""},{"$f":"IF(H172=\"Low Point\",C172,\" \")","v":" "}]
[null,2,18,9,{"$f":"F172","v":316.67941176470589},{"$f":"E173-D173","v":307.67941176470589},"+ / +",""," "]
[null,3,27,124.5,{"$f":"F173","v":307.67941176470589},{"$f":"E174-D174","v":183.17941176470589},{"$f":"IF(AND(E174>=0,F174>=0),\"+ / +\",IF(AND(E174<=0,F174<=0),\"- / -\",\"+ / -\"))","v":"+ / +"},{"$f":"IF(G174=\"+ / -\",\"Low Point\",\"\")","v":""},{"$f":"IF(H174=\"Low Point\",C174,\" \")","v":" "}]
[null,4,55,94,{"$f":"F174","v":183.17941176470589},{"$f":"E175-D175","v":89.17941176470589},"+ / +",{"$f":"IF(G175=\"+ / -\",\"Low Point\",\"\")","v":""}," "]
[null,5,75,84,{"$f":"F175","v":89.17941176470589},5.1794117647058897,"+ / +",""," "]
[null,6,83,46.5,5.1794117647058897,-41.32058823529411,"+ / -","Low Point",83]
[null,7,90,93,-41.32058823529411,-134.32058823529411,"- / -",""," "]
[null,8,129,94.625,-134.32058823529411,-228.94558823529411,"- / -",""," "]
[null,9,139.25,10.25,-228.94558823529411,-239.19558823529411,"- / -",""," "]
[null,10,149.5,10.25,-239.19558823529411,-249.44558823529411,"- / -",""," "]
[null,11,159.75,10.25,-249.44558823529411,-259.69558823529411,"- / -",""," "]
[null,12,170,0,-259.69558823529411,-259.69558823529411,"- / -",""," "]
[null,13,0,0,-259.69558823529411,-259.69558823529411,"- / -",""," "]
[null,14,0,0,-259.69558823529411,-259.69558823529411,"- / -",""," "]
[null,15,0,0,-259.69558823529411,-259.69558823529411,"- / -",""," "]
[null,"Support 1",{"$f":"C21","v":170},{"$f":"C164","v":259.69558823529411},{"$f":"F186","v":-259.69558823529411},{"$f":"E187+D187","v":0},"- / -",""," "]
[]
[null,"The Low Point occurs at:",null,{"$f":"MAX(I171:I187)","v":83},"feet from Support 2"]
["Calculation: Sum Moments about Low Point to Determine Horizontal Reaction:"]
[]
[null,"Maximum Allowable Sag:",null,{"$f":"(G21/100)*C21","v":8.5},"feet"]
[null,"Summing Moments about the Low point (Counter-Clockwise Positive):"]
[]
[null,"Location","Distance from Low Point","Load","Moment"]
[null,"Support 2",{"$f":"D189","v":83},{"$f":"D171","v":330.17941176470589},{"$f":"C196*D196","v":27404.891176470588}]
[null,{"$f":"B120","v":1},{"$f":"IF(C172=0,0,IF(C172<$D$189,($D$189-C172),0))","v":74},13.5,{"$f":"-C197*D197","v":-999}]
[null,2,65,9,{"$f":"-C198*D198","v":-585}]
[null,3,56,124.5,{"$f":"-C199*D199","v":-6972}]
[null,4,28,94,{"$f":"-C200*D200","v":-2632}]
[null,5,8,84,{"$f":"-C201*D201","v":-672}]
[null,6,0,46.5,0]
[null,7,0,93,0]
[null,8,0,94.625,0]
[null,9,0,10.25,0]
[null,10,0,10.25,0]
[null,11,0,10.25,0]
[null,12,0,0,0]
[null,13,0,0,0]
[null,14,0,0,0]
[null,15,0,0,0]
[null,"Support 1",0,259.69558823529411,0]
[]
[null,"Determine Horizontal force:"]
[null,"H = ",{"$f":"ABS(SUM(E196:E212)/D192)","v":1828.8107266435986},"lbs"]
[]
["Calculate Actual Length of Cable (Accounting for sag, Dead Load Only):"]
[null,"Fy = Shear 2, calculated above."]
[]
[null,"Location","Fy","xi","Length of Segment"]
[null,"Support 1"]
[null,{"$f":"B120","v":1},{"$f":"E172","v":330.17941176470589},{"$f":"IF(B222<($G$6+1),((C172-C171)),(IF(B222=($G$6+1),(($C$187-C171)),0)))","v":9},{"$f":"SQRT($C$215^2+C222^2)*(D222/$C$215)","v":9.1455051663413514}]
[null,2,{"$f":"E173","v":316.67941176470589},9,{"$f":"SQRT($C$215^2+C223^2)*(D223/$C$215)","v":9.1339353124358862}]
[null,3,307.67941176470589,9,9.1264826140034465]
[null,4,183.17941176470589,28,28.140106611284597]
[null,5,89.17941176470589,20,20.023764776807951]
[null,6,5.1794117647058897,8,8.0000320835545242]
[null,7,-41.32058823529411,7,7.0017865208881274]
[null,8,-134.32058823529411,39,39.105050408714462]
[null,9,-228.94558823529411,10.25,10.330007231970136]
[null,10,-239.19558823529411,10.25,10.337300581206176]
[null,11,-249.44558823529411,10.25,10.34490782310675]
[null,12,-259.69558823529411,10.25,10.352828265728377]
[null,13,-259.69558823529411,0,0]
[null,14,-259.69558823529411,0,0]
[null,15,-259.69558823529411,0,0]
[null,"Support 2",-259.69558823529411,0,0]
[]
[null,null,null,"Total Length =",{"$f":"SUM(E221:E237)","v":171.04170739604183}]
["Wind Loading"]
[]
["Calculate Reactions at each support:"]
[]
[null,"Summing moments about Support 2 (Clockwise moments positive):"]
[]
[null,"Loading","Wind Load","Arm","Moment"]
[null,{"$f":"B120","v":1},{"$f":"E120","v":14.710848},{"$f":"C120","v":9},{"$f":"C247*D247","v":132.39763200000002}]
[null,2,11.421696000000001,18,{"$f":"C248*D248","v":205.59052800000001}]
[null,3,732.2045508266666,27,19769.522872319998]
[null,4,321.52420351999996,55,17683.831193599999]
[null,5,308.83343018666665,75,23162.507264]
[null,6,256.64204799999999,83,21301.289983999999]
[null,7,320.25512618666664,90,28822.961356799999]
[null,8,322.31737685333331,129,41578.941614079995]
[null,9,13.008042666666666,139.25,1811.3699413333334]
[null,10,13.008042666666666,149.5,1944.7023786666666]
[null,11,13.008042666666666,159.75,2078.0348159999999]
[null,12,0,170,0]
[null,13,0,0,0]
[null,14,0,0,0]
[null,15,0,0,0]
[]
[null,"S MomentsSupport 2 = 0 = [(S Loadn * Xn)] - (R Support 1 * Length)"]
[null,"R Support 1 =",{"$f":"(SUM(E247:E261)/C21)","v":932.30087988705884},"lbs"]
[]
[null,"S Forcey = 0 = R Support 2 + R Support 1 - (S Loadn)"]
[null,"R Support 2 =",{"$f":"(SUM(C247:C261))-C264","v":1394.6325276862749},"lbs"]
[]
["Wind Load Shear Diagram:"]
[null,"Location","Distance","Load / Reaction","Shear 1","Shear 2"]
[null,"Support 2",0,{"$f":"C267","v":1394.6325276862749},{"$f":"0","v":0},{"$f":"E271+C267","v":1394.6325276862749}]
[null,{"$f":"B222","v":1},{"$f":"C120","v":9},{"$f":"E120","v":14.710848},{"$f":"IF(D272>0,F271,\" \")","v":1394.6325276862749},{"$f":"IF(D271>0,E272-D272,\" \")","v":1379.921679686275}]
[null,2,18,11.421696000000001,{"$f":"F272","v":1379.921679686275},{"$f":"E273-D273","v":1368.4999836862748}]
[null,3,27,732.2045508266666,1368.4999836862748,636.29543285960824]
[null,4,55,321.52420351999996,636.29543285960824,314.77122933960828]
[null,5,75,308.83343018666665,314.77122933960828,5.9377991529416363]
[null,6,83,256.64204799999999,5.9377991529416363,-250.70424884705835]
[null,7,90,320.25512618666664,-250.70424884705835,-570.959375033725]
[null,8,129,322.31737685333331,-570.959375033725,-893.27675188705825]
[null,9,139.25,13.008042666666666,-893.27675188705825,-906.28479455372496]
[null,10,149.5,13.008042666666666,-906.28479455372496,-919.29283722039168]
[null,11,159.75,13.008042666666666,-919.29283722039168,-932.30087988705839]
[null,12,170,0,-932.30087988705839,-932.30087988705839]
[null,13,0,0,-932.30087988705839,-932.30087988705839]
[null,14,0,0,-932.30087988705839,-932.30087988705839]
[null,15,0,0,-932.30087988705839,-932.30087988705839]
[null,"Support 1",{"$f":"C21","v":170},{"$f":"C264","v":932.30087988705884},{"$f":"F286","v":-932.30087988705839},{"$f":"E287+D287","v":0}]
[]
[]
["Ice Load"]
[]
["Calculate Reactions at each support:"]
[]
[null,"Summing moments about Support 2 (Clockwise moments positive):"]
[]
[null,"Loading","Ice Load","Arm","Moment"]
[null,{"$f":"B120","v":1},{"$f":"F120","v":10.8},{"$f":"C120","v":9},{"$f":"C297*D297","v":97.2}]
[null,2,3.6,18,{"$f":"C298*D298","v":64.8}]
[null,3,71.39,27,1927.53]
[null,4,68.16,55,3748.7999999999997]
[null,5,64.16,75,4812]
[null,6,25.5,83,2116.5]
[null,7,67.760000000000005,90,6098.4000000000005]
[null,8,68.41,129,8824.89]
[null,9,4.1000000000000005,139.25,570.92500000000007]
[null,10,4.1000000000000005,149.5,612.95000000000005]
[null,11,4.1000000000000005,159.75,654.97500000000014]
[null,12,0,170,0]
[null,13,0,0,0]
[null,14,0,0,0]
[null,15,0,0,0]
[]
[null,"S MomentsSupport 2 = 0 = [(S Loadn * Xn)] - (R Support 1 * Length)"]
[null,"R Support 1 =",{"$f":"(SUM(E297:E311)/C21)","v":173.69982352941176},"lbs"]
[]
[null,"S Forcey = 0 = R Support 2 + R Support 1 - (S Loadn)"]
[null,"R Support 2 =",{"$f":"(SUM(C297:C311))-C314","v":218.38017647058828},"lbs"]
[]
["Ice Load Shear Diagram:"]
[null,"Location","Distance","Load / Reaction","Shear 1","Shear 2"]
[null,"Support 2",{"$f":"0","v":0},{"$f":"C317","v":218.38017647058828},0,{"$f":"E321+C317","v":218.38017647058828}]
[null,{"$f":"B120","v":1},9,{"$f":"F120","v":10.8},{"$f":"IF(D322>0,F321,\" \")","v":218.38017647058828},{"$f":"IF(D321>0,E322-D322,\" \")","v":207.58017647058827}]
[null,2,18,3.6,{"$f":"F322","v":207.58017647058827},{"$f":"E323-D323","v":203.98017647058828}]
[null,3,27,71.39,203.98017647058828,132.59017647058829]
[null,4,55,68.16,132.59017647058829,64.430176470588293]
[null,5,75,64.16,64.430176470588293,0.27017647058829652]
[null,6,83,25.5,0.27017647058829652,-25.229823529411703]
[null,7,90,67.760000000000005,-25.229823529411703,-92.989823529411709]
[null,8,129,68.41,-92.989823529411709,-161.39982352941172]
[null,9,139.25,4.1000000000000005,-161.39982352941172,-165.49982352941171]
[null,10,149.5,4.1000000000000005,-165.49982352941171,-169.59982352941171]
[null,11,159.75,4.1000000000000005,-169.59982352941171,-173.6998235294117]
[null,12,170,0,-173.6998235294117,-173.6998235294117]
[null,13,0,0,-173.6998235294117,-173.6998235294117]
[null,14,0,0,-173.6998235294117,-173.6998235294117]
[null,15,0,0,-173.6998235294117,-173.6998235294117]
[null,"Support 1",{"$f":"C21","v":170},{"$f":"C314","v":173.69982352941176},{"$f":"IF(D337>0,F336,\" \")","v":-173.6998235294117},{"$f":"E337+D337","v":0}]
[]
["Determine Fx - Group II (Dead + Wind)"]
[]
[null,"Value for Fx:",4937.1393266081068,null,"Fx2 =",{"$f":"C341*C341","v":24375344.73034035}]
[]
[null,"Location","Fyi","Fyi2","Fzi","Fzi2","xi","Vector Component"]
[null,{"$f":"B120","v":1},{"$f":"F171","v":330.17941176470589},{"$f":"C344*C344","v":109018.44395328721},{"$f":"F271","v":1394.6325276862749},{"$f":"E344*E344","v":1944999.8872806083},{"$f":"D222","v":9},{"$f":"(($F$341+D344+F344)^(0.5))*(G344/$C$341)","v":9.3715294580779656}]
[null,2,316.67941176470589,{"$f":"C345*C345","v":100285.84983564014},1379.921679686275,{"$f":"E345*E345","v":1904183.8420681905},9,{"$f":"(($F$341+D345+F345)^(0.5))*(G345/$C$341)","v":9.3627406656559451}]
[null,3,307.67941176470589,94666.620423875444,1368.4999836862748,1872792.2053493345,9,9.3561704001467092]
[null,4,183.17941176470589,33554.696894463668,636.29543285960824,404871.87787799624,28,28.250688449749266]
[null,5,89.17941176470589,7952.9674826989631,314.77122933960828,99080.92681996827,20,20.043862621992378]
[null,6,5.1794117647058897,26.826306228373777,5.9377991529416363,35.257458780674412,8,8.0000101879544552]
[null,7,-41.32058823529411,1707.391012110726,-250.70424884705835,62852.620389967757,7,7.0092638943980434]
[null,8,-134.32058823529411,18042.02042387543,-570.959375033725,325994.60793890181,39,39.274261062411853]
[null,9,-228.94558823529411,52416.082372404839,-893.27675188705825,797943.35546189302,10.25,10.427258286894059]
[null,10,-239.19558823529411,57214.529431228373,-906.28479455372496,821352.12883928744,10.25,10.433086504713804]
[null,11,-249.44558823529411,62223.1014900519,-919.29283722039168,845099.32056471752,10.25,10.439024713886148]
[null,12,-259.69558823529411,67441.798548875435,-932.30087988705839,869184.93063818326,10.25,10.445072726814983]
[null,13,-259.69558823529411,67441.798548875435,-932.30087988705839,869184.93063818326,0,0]
[null,14,-259.69558823529411,67441.798548875435,-932.30087988705839,869184.93063818326,0,0]
[null,15,-259.69558823529411,67441.798548875435,-932.30087988705839,869184.93063818326,0,0]
[null,null,null,null,null,null,"Total:",{"$f":"SUM(H344:H358)","v":172.41296897269558}]
[null,null,"Actual Length :",null,{"$f":"E239","v":171.04170739604183}]
[null,null,"Percentage Difference:",null,{"$f":"(ABS(H359-E360)/E360)*100","v":0.80171181493098453},"%*"]
[]
[null,"* The Percentage Difference should be 0.00 % "]
[]
[]
["Determine Fx - Group III (Dead + Ice + 0.5 · Wind)"]
[]
[null,"Value for Fx:",3176.3446417717596,null,"Fx2 =",{"$f":"C368*C368","v":10089165.283312168}]
[]
[null,"Location","Fyi","Fyi2","Fzi","Fzi2","xi","Vector Component"]
[null,{"$f":"B120","v":1},{"$f":"F171+F321","v":548.5595882352942},{"$f":"C371*C371","v":300917.62184487551},{"$f":"0.5*F271","v":697.31626384313745},{"$f":"E371*E371","v":486249.97182015207},{"$f":"D222","v":9},{"$f":"(($F$368+D371+F371)^(0.5))*(G371/$C$368)","v":9.3445014664413257}]
[null,2,{"$f":"F172+F322","v":524.25958823529413},{"$f":"C372*C372","v":274848.11585664016},{"$f":"0.5*F272","v":689.96083984313748},{"$f":"E372*E372","v":476045.96051704761},{"$f":"D223","v":9},{"$f":"(($F$368+D372+F372)^(0.5))*(G372/$C$368)","v":9.3289060895265035}]
[null,3,511.65958823529417,261795.53423311078,684.24999184313742,468198.05133733363,9,9.3199083163704337]
[null,4,315.76958823529418,99710.432854287239,318.14771642980412,101217.96946949906,28,28.277439203744422]
[null,5,153.60958823529418,23595.905597816629,157.38561466980414,24770.231704992068,20,20.047881374958131]
[null,6,5.4495882352941862,29.698011934256805,2.9688995764708181,8.814364695168603,8,8.0000152687913406]
[null,7,-66.550411764705814,4428.9573060518942,-125.35212442352918,15713.155097491939,7,7.006983951702999]
[null,8,-227.3104117647058,51670.023296640102,-285.4796875168625,81498.651984725453,39,39.25654019081886]
[null,9,-390.34541176470583,152369.54048575775,-446.63837594352913,199485.83886547326,10.25,10.42720050288756]
[null,10,-404.6954117647058,163778.37630340477,-453.14239727686248,205338.03220982186,10.25,10.435816034453207]
[null,11,-419.04541176470582,175599.05712105185,-459.64641861019584,211274.83014117938,10.25,10.444671943624416]
[null,12,-433.39541176470584,187831.58293869894,-466.15043994352919,217296.23265954581,10.25,10.45376761949354]
[null,13,-433.39541176470584,187831.58293869894,-466.15043994352919,217296.23265954581,0,0]
[null,14,-433.39541176470584,187831.58293869894,-466.15043994352919,217296.23265954581,0,0]
[null,15,-433.39541176470584,187831.58293869894,-466.15043994352919,217296.23265954581,0,0]
[null,null,null,null,null,null,"Total:",{"$f":"SUM(H371:H385)","v":172.34363196281276}]
[null,null,"Actual Length :",null,{"$f":"E239","v":171.04170739604183}]
[null,null,"Percentage Difference:",null,{"$f":"(ABS(H386-E387)/E387)*100","v":0.76117374328845377},"%*"]
[]
[null,"* The Percentage Difference should be 0.00 % "]
[]
[]
[]
["FINAL RESULTS:"]
[]
[null,"Span Wire Present:",{"$f":"Input!I51","v":"YES"}]
[]
["Support Reactions:"]
["Support 1 (Left)",null,null,"Support 2 (Right)",null,null,"Group Load"]
["Fx","Fy","Fz","Fx","Fy","Fz"]
[{"$f":"IF(C396=\"YES\",C215,0)","v":1828.8107266435986},{"$f":"IF(C396=\"YES\",C164,0)","v":259.69558823529411},{"$f":"0","v":0},{"$f":"IF(C396=\"YES\",C215,0)","v":1828.8107266435986},{"$f":"IF(C396=\"YES\",C167,0)","v":330.17941176470589},{"$f":"0","v":0},"Group I","(DL)"]
[{"$f":"IF(C396=\"YES\",C341,0)","v":4937.1393266081068},{"$f":"IF(C396=\"YES\",C164,0)","v":259.69558823529411},{"$f":"IF(C396=\"YES\",C264,0)","v":932.30087988705884},{"$f":"IF(C396=\"YES\",C341,0)","v":4937.1393266081068},{"$f":"IF(C396=\"YES\",C167,0)","v":330.17941176470589},{"$f":"IF(C396=\"YES\",C267,0)","v":1394.6325276862749},"Group II","(DL + WL)"]
[{"$f":"IF(C396=\"YES\",C368,0)","v":3176.3446417717596},{"$f":"IF(C396=\"YES\",C164+C314,0)","v":433.39541176470584},{"$f":"IF(C396=\"YES\",0.5*C264,0)","v":466.15043994352942},{"$f":"IF(C396=\"YES\",C368,0)","v":3176.3446417717596},{"$f":"IF(C396=\"YES\",C167+C317,0)","v":548.5595882352942},{"$f":"IF(C396=\"YES\",0.5*C267,0)","v":697.31626384313745},"Group III","(DL + IL + 0.5 · WL)"]
[]
["Wire Tension:"]
["Support 1","Support 2","Group Load"]
[{"$f":"SQRT(A401^2+B401^2+C401^2)","v":1847.1574032646927},{"$f":"SQRT(D401^2+E401^2+F401^2)","v":1858.3775498643902},"Group I","(DL)"]
[{"$f":"SQRT(A402^2+B402^2+C402^2)","v":5031.100422325856},{"$f":"SQRT(D402^2+E402^2+F402^2)","v":5140.9496264381205},"Group II","(DL + WL)"]
[{"$f":"SQRT(A403^2+B403^2+C403^2)","v":3239.4896355615051},{"$f":"SQRT(D403^2+E403^2+F403^2)","v":3297.9285736621396},"Group III","(DL + IL + 0.5 · WL)"]

{"sheet":"SW4","index":7,"n_rows":409,"n_cols":9,"rows_kept":409,"cut":false,"hidden":false,"merged":[[162,1,162,5],[2,1,2,8],[4,1,6,4],[20,4,20,5],[25,0,25,8],[48,2,53,2],[218,6,218,7],[398,0,398,2],[398,3,398,5],[398,6,399,8],[405,2,405,4]]}
["Strain Pole Design - SW4 Cable Stringing Tension"]
[]
["Assumptions:","This spreadsheet calculates the tension in strain poles for overhead sign in accordance with the AASHTO Specifications for Structural Supports for Highway Signs, Luminaires and Traffic Signals 4th Edition 2001, including the 2002 and 2003 Interims (Per DM-4), and the Pennsylvania Department of Transportation Criteria for the Design of Traffic Related Structures."]
[]
[null,"Number of assumed concentrated loads on the strain pole cable.  Also must consider concentrated cable loads with a minimum of 5 segments.",null,null,null," "," ",null,"Y"]
[null,null,null,null,null,"=",{"$f":"I51","v":12}]
[null,null,null,null,null,null,null,"M"]
[]
[null,"Support 1 (Left)",null,null,null,null,"X",null,"Support 2 (Right)      "]
[]
[]
[]
[null,null,null,null,null,null,"Loadn"]
[]
[]
[]
[null,null,null,null,null,null,"Xn"]
[]
[null,null,null,null,"Length"]
[]
[null,"Length:",{"$f":"L4_","v":160},"feet","Maximum Allowable Sag:",null,5,"percent"]
[]
[]
["Rank loading ID's from right to left ( Support 2 to Support 1) and calculate wire segment lengths:"]
[]
["The spreadsheet assumes that 3 wire segments are placed before the first point load and 2 wire segments are placed after the last point load.  The number of point loads is calculated by adding the number of point loads input and adding 5 point loads due to the wire segments."]
[]
[null,"Original Rank","Re-rank","Final Rank","Loading ID","Distance"]
[null,{"$f":"IF(F29<>\"N/A\",RANK(F29,$F$29:$F$37,1),\"Exclude\")","v":6},{"$f":"IF(ISNUMBER(B29)=TRUE,B29,MAX($B$29:$B$37)+1)","v":6},{"$f":"RANK(C29,$C$29:$C$37,1)","v":6},"M",{"$f":"IF(Input!H77=\"None\",\"N/A\",Input!I77)","v":120}]
[null,5,{"$f":"IF(ISNUMBER(B30)=TRUE,B30,MAX($B$29:$B$37)+2)","v":5},5,"N",{"$f":"IF(Input!H78=\"None\",\"N/A\",Input!I78)","v":95}]
[null,3,{"$f":"IF(ISNUMBER(B31)=TRUE,B31,MAX($B$29:$B$37)+3)","v":3},3,"O",{"$f":"IF(Input!H79=\"None\",\"N/A\",Input!I79)","v":72}]
[null,2,{"$f":"IF(ISNUMBER(B32)=TRUE,B32,MAX($B$29:$B$37)+4)","v":2},2,"P",{"$f":"IF(Input!H80=\"None\",\"N/A\",Input!I80)","v":50}]
[null,7,{"$f":"IF(ISNUMBER(B33)=TRUE,B33,MAX($B$29:$B$37)+5)","v":7},7,"R",{"$f":"IF(Input!G81=\"None\",\"N/A\",Input!I81)","v":125}]
[null,4,{"$f":"IF(ISNUMBER(B34)=TRUE,B34,MAX($B$29:$B$37)+6)","v":4},4,"S",{"$f":"IF(Input!G82=\"None\",\"N/A\",Input!I82)","v":90}]
[null,"Exclude",{"$f":"IF(ISNUMBER(B35)=TRUE,B35,MAX($B$29:$B$37)+7)","v":14},8,"T",{"$f":"IF(Input!G83=\"None\",\"N/A\",Input!I83)","v":"N/A"}]
[null,"Exclude",{"$f":"IF(ISNUMBER(B36)=TRUE,B36,MAX($B$29:$B$37)+8)","v":15},9,"U",{"$f":"IF(Input!G84=\"None\",\"N/A\",Input!I84)","v":"N/A"}]
[null,1,{"$f":"IF(ISNUMBER(B37)=TRUE,B37,MAX($B$29:$B$37)+9)","v":1},1,"Y",{"$f":"IF(Input!G85=\"None\",\"N/A\",Input!I85)","v":27}]
[]
[null,null,"Rank","Loading ID","Distance","Count"]
[null,null,1,{"$f":"VLOOKUP(C40,$D$29:$F$37,2,0)","v":"Y"},{"$f":"VLOOKUP(C40,$D$29:$F$37,3,0)","v":27},{"$f":"IF(E40<>\"N/A\",1,0)","v":1}]
[null,null,2,"P",50,1]
[null,null,3,"O",72,1]
[null,null,4,"S",90,1]
[null,null,5,"N",95,1]
[null,null,6,"M",120,1]
[null,null,7,"R",125,1]
[null,null,8,"T","N/A",0]
[null,null,9,"U","N/A",0]
[null,null,"Wire Sections","W1",{"$f":"MIN(E40:E48)/3","v":9}]
[null,null,null,"W2",{"$f":"MIN(E40:E48)/3+E49","v":18},null,null,"Number of Point Loads:",{"$f":"SUM(F40:F48)","v":7}]
[null,null,null,"W3",{"$f":"(C21-MAX(E40:E48))/4+MAX(E40:E48)","v":133.75},null,null,"No. of Point Loads w/ Wire Segments:",{"$f":"I50+5","v":12}]
[null,null,null,"W4",{"$f":"(C21-MAX(E40:E48))/4+E51","v":142.5}]
[null,null,null,"W5",{"$f":"(C21-MAX(E40:E48))/4+E52","v":151.25}]
[null,null,null,"W6",{"$f":"C21","v":160}]
[]
[]
["Rank ID's and Wire Segments from right to left ( Support 2 to Support 1) and calculate loading:"]
[]
[null,null,"Original Rank With Wire","Re-rank","Final Rank","Loading ID","Distance"]
[null,null,{"$f":"IF(E40<>\"N/A\",RANK(E40,$E$40:$E$54,1),\"Exclude\")","v":3},{"$f":"IF(ISNUMBER(C60)=TRUE,C60,MAX($C$60:$C$74)+1)","v":3},{"$f":"RANK(D60,$D$60:$D$74,1)","v":3},{"$f":"D40","v":"Y"},{"$f":"E40","v":27}]
[null,null,4,{"$f":"IF(ISNUMBER(C61)=TRUE,C61,MAX($C$60:$C$74)+2)","v":4},4,"P",50]
[null,null,5,{"$f":"IF(ISNUMBER(C62)=TRUE,C62,MAX($C$60:$C$74)+3)","v":5},5,"O",72]
[null,null,6,{"$f":"IF(ISNUMBER(C63)=TRUE,C63,MAX($C$60:$C$74)+4)","v":6},6,"S",90]
[null,null,7,{"$f":"IF(ISNUMBER(C64)=TRUE,C64,MAX($C$60:$C$74)+5)","v":7},7,"N",95]
[null,null,8,{"$f":"IF(ISNUMBER(C65)=TRUE,C65,MAX($C$60:$C$74)+6)","v":8},8,"M",120]
[null,null,9,{"$f":"IF(ISNUMBER(C66)=TRUE,C66,MAX($C$60:$C$74)+7)","v":9},9,"R",125]
[null,null,"Exclude",{"$f":"IF(ISNUMBER(C67)=TRUE,C67,MAX($C$60:$C$74)+8)","v":21},14,"T","N/A"]
[null,null,"Exclude",{"$f":"IF(ISNUMBER(C68)=TRUE,C68,MAX($C$60:$C$74)+9)","v":22},15,"U","N/A"]
[null,null,1,{"$f":"IF(ISNUMBER(C69)=TRUE,C69,MAX($C$60:$C$74)+10)","v":1},1,"W1",9]
[null,null,2,{"$f":"IF(ISNUMBER(C70)=TRUE,C70,MAX($C$60:$C$74)+11)","v":2},2,"W2",18]
[null,null,10,{"$f":"IF(ISNUMBER(C71)=TRUE,C71,MAX($C$60:$C$74)+12)","v":10},10,"W3",133.75]
[null,null,11,{"$f":"IF(ISNUMBER(C72)=TRUE,C72,MAX($C$60:$C$74)+13)","v":11},11,"W4",142.5]
[null,null,12,{"$f":"IF(ISNUMBER(C73)=TRUE,C73,MAX($C$60:$C$74)+14)","v":12},12,"W5",151.25]
[null,null,13,{"$f":"IF(ISNUMBER(C74)=TRUE,C74,MAX($C$60:$C$74)+15)","v":13},13,"W6",160]
[]
[null,"Final Rank","Loading ID","Distance","Distance for Table","Load description","Signal Config/Sign Size/Wire Dia"]
[null,1,{"$f":"VLOOKUP(B77,$E$60:$G$74,2,0)","v":"W1"},{"$f":"VLOOKUP(B77,$E$60:$G$74,3,0)","v":9},{"$f":"IF(ISNUMBER(D77),D77,0)","v":9},{"$f":"IF(OR(C77=$D$49,C77=$D$50,C77=$D$51,C77=$D$52,C77=$D$53,C77=$D$54),\"Wire\",VLOOKUP(C77,Input!$B$77:$C$85,2,0))","v":"Wire"},{"$f":"IF(F77=\"Signal\",VLOOKUP(C77,Input!$B$77:$I$85,7,0),IF(F77=\"Sign\",VLOOKUP(C77,Input!$B$77:$I$85,6,0),SW4_Wire_Dia))","v":"0.5\""}]
[null,2,"W2",18,18,{"$f":"IF(OR(C78=$D$49,C78=$D$50,C78=$D$51,C78=$D$52,C78=$D$53,C78=$D$54),\"Wire\",VLOOKUP(C78,Input!$B$77:$C$85,2,0))","v":"Wire"},{"$f":"IF(F78=\"Signal\",VLOOKUP(C78,Input!$B$77:$I$85,7,0),IF(F78=\"Sign\",VLOOKUP(C78,Input!$B$77:$I$85,6,0),SW4_Wire_Dia))","v":"0.5\""}]
[null,3,"Y",27,27,{"$f":"IF(OR(C79=$D$49,C79=$D$50,C79=$D$51,C79=$D$52,C79=$D$53,C79=$D$54),\"Wire\",VLOOKUP(C79,Input!$B$77:$C$85,2,0))","v":"Sign"},{"$f":"IF(F79=\"Signal\",VLOOKUP(C79,Input!$B$77:$I$85,7,0),IF(F79=\"Sign\",VLOOKUP(C79,Input!$B$77:$I$85,6,0),SW4_Wire_Dia))","v":"96\" x 32\""}]
[null,4,"P",50,50,{"$f":"IF(OR(C80=$D$49,C80=$D$50,C80=$D$51,C80=$D$52,C80=$D$53,C80=$D$54),\"Wire\",VLOOKUP(C80,Input!$B$77:$C$85,2,0))","v":"Signal"},{"$f":"IF(F80=\"Signal\",VLOOKUP(C80,Input!$B$77:$I$85,7,0),IF(F80=\"Sign\",VLOOKUP(C80,Input!$B$77:$I$85,6,0),SW4_Wire_Dia))","v":"A-3"}]
[null,5,"O",72,72,{"$f":"IF(OR(C81=$D$49,C81=$D$50,C81=$D$51,C81=$D$52,C81=$D$53,C81=$D$54),\"Wire\",VLOOKUP(C81,Input!$B$77:$C$85,2,0))","v":"Signal"},{"$f":"IF(F81=\"Signal\",VLOOKUP(C81,Input!$B$77:$I$85,7,0),IF(F81=\"Sign\",VLOOKUP(C81,Input!$B$77:$I$85,6,0),SW4_Wire_Dia))","v":"A-3"}]
[null,6,"S",90,90,{"$f":"IF(OR(C82=$D$49,C82=$D$50,C82=$D$51,C82=$D$52,C82=$D$53,C82=$D$54),\"Wire\",VLOOKUP(C82,Input!$B$77:$C$85,2,0))","v":"Sign"},{"$f":"IF(F82=\"Signal\",VLOOKUP(C82,Input!$B$77:$I$85,7,0),IF(F82=\"Sign\",VLOOKUP(C82,Input!$B$77:$I$85,6,0),SW4_Wire_Dia))","v":"30\" x 36\""}]
[null,7,"N",95,95,{"$f":"IF(OR(C83=$D$49,C83=$D$50,C83=$D$51,C83=$D$52,C83=$D$53,C83=$D$54),\"Wire\",VLOOKUP(C83,Input!$B$77:$C$85,2,0))","v":"Signal"},{"$f":"IF(F83=\"Signal\",VLOOKUP(C83,Input!$B$77:$I$85,7,0),IF(F83=\"Sign\",VLOOKUP(C83,Input!$B$77:$I$85,6,0),SW4_Wire_Dia))","v":"A-3"}]
[null,8,"M",120,120,{"$f":"IF(OR(C84=$D$49,C84=$D$50,C84=$D$51,C84=$D$52,C84=$D$53,C84=$D$54),\"Wire\",VLOOKUP(C84,Input!$B$77:$C$85,2,0))","v":"Signal"},{"$f":"IF(F84=\"Signal\",VLOOKUP(C84,Input!$B$77:$I$85,7,0),IF(F84=\"Sign\",VLOOKUP(C84,Input!$B$77:$I$85,6,0),SW4_Wire_Dia))","v":"A-5"}]
[null,9,"R",125,125,{"$f":"IF(OR(C85=$D$49,C85=$D$50,C85=$D$51,C85=$D$52,C85=$D$53,C85=$D$54),\"Wire\",VLOOKUP(C85,Input!$B$77:$C$85,2,0))","v":"Sign"},{"$f":"IF(F85=\"Signal\",VLOOKUP(C85,Input!$B$77:$I$85,7,0),IF(F85=\"Sign\",VLOOKUP(C85,Input!$B$77:$I$85,6,0),SW4_Wire_Dia))","v":"30\" x 36\""}]
[null,10,"W3",133.75,133.75,{"$f":"IF(OR(C86=$D$49,C86=$D$50,C86=$D$51,C86=$D$52,C86=$D$53,C86=$D$54),\"Wire\",VLOOKUP(C86,Input!$B$77:$C$85,2,0))","v":"Wire"},{"$f":"IF(F86=\"Signal\",VLOOKUP(C86,Input!$B$77:$I$85,7,0),IF(F86=\"Sign\",VLOOKUP(C86,Input!$B$77:$I$85,6,0),SW4_Wire_Dia))","v":"0.5\""}]
[null,11,"W4",142.5,142.5,{"$f":"IF(OR(C87=$D$49,C87=$D$50,C87=$D$51,C87=$D$52,C87=$D$53,C87=$D$54),\"Wire\",VLOOKUP(C87,Input!$B$77:$C$85,2,0))","v":"Wire"},{"$f":"IF(F87=\"Signal\",VLOOKUP(C87,Input!$B$77:$I$85,7,0),IF(F87=\"Sign\",VLOOKUP(C87,Input!$B$77:$I$85,6,0),SW4_Wire_Dia))","v":"0.5\""}]
[null,12,"W5",151.25,151.25,{"$f":"IF(OR(C88=$D$49,C88=$D$50,C88=$D$51,C88=$D$52,C88=$D$53,C88=$D$54),\"Wire\",VLOOKUP(C88,Input!$B$77:$C$85,2,0))","v":"Wire"},{"$f":"IF(F88=\"Signal\",VLOOKUP(C88,Input!$B$77:$I$85,7,0),IF(F88=\"Sign\",VLOOKUP(C88,Input!$B$77:$I$85,6,0),SW4_Wire_Dia))","v":"0.5\""}]
[null,13,"W6",160,160,{"$f":"IF(OR(C89=$D$49,C89=$D$50,C89=$D$51,C89=$D$52,C89=$D$53,C89=$D$54),\"Wire\",VLOOKUP(C89,Input!$B$77:$C$85,2,0))","v":"Wire"},{"$f":"IF(F89=\"Signal\",VLOOKUP(C89,Input!$B$77:$I$85,7,0),IF(F89=\"Sign\",VLOOKUP(C89,Input!$B$77:$I$85,6,0),SW4_Wire_Dia))","v":"0.5\""}]
[null,14,"T","N/A",0,{"$f":"IF(OR(C90=$D$49,C90=$D$50,C90=$D$51,C90=$D$52,C90=$D$53,C90=$D$54),\"Wire\",VLOOKUP(C90,Input!$B$77:$C$85,2,0))","v":"Sign"},{"$f":"IF(F90=\"Signal\",VLOOKUP(C90,Input!$B$77:$I$85,7,0),IF(F90=\"Sign\",VLOOKUP(C90,Input!$B$77:$I$85,6,0),SW4_Wire_Dia))","v":"None"}]
[null,15,"U","N/A",0,{"$f":"IF(OR(C91=$D$49,C91=$D$50,C91=$D$51,C91=$D$52,C91=$D$53,C91=$D$54),\"Wire\",VLOOKUP(C91,Input!$B$77:$C$85,2,0))","v":"Sign"},{"$f":"IF(F91=\"Signal\",VLOOKUP(C91,Input!$B$77:$I$85,7,0),IF(F91=\"Sign\",VLOOKUP(C91,Input!$B$77:$I$85,6,0),SW4_Wire_Dia))","v":"None"}]
[]
["Calculate Loads:"]
[]
[null,"Wire Weights:"]
[null,null,"Wire Weight =",{"$f":"VLOOKUP(SW1_Wire_Dia,'Pick Lists & Data'!A29:B33,2,0)","v":1},"lb/ft"]
[null,null,"Wire Wind Load =",{"$f":"VLOOKUP(SW1_Wire_Dia,'Pick Lists & Data'!A29:L33,10,0)","v":1.2690773333333334},"lb/ft"]
[null,null,"Wire Ice Load =",{"$f":"VLOOKUP(SW1_Wire_Dia,'Pick Lists & Data'!A29:L33,12,0)","v":0.4},"lb/ft"]
[]
["Loading Final Rank","Distance for Table","Signal Config/Sign Size/Wire Dia","Wire Segment Dead Load","Signal/Sign Dead Load","Wire Segment Wind Load","Signal/Sign Wind Load","Wire Segment Ice Load","Signal/Sign Ice Load"]
[{"$f":"B77","v":1},{"$f":"E77","v":9},{"$f":"G77","v":"0.5\""},{"$f":"$D$77+($D$78-$D$77)*0.5*$D$96","v":13.5},{"$f":"IF($F77=\"Wire\",0,IF($F77=\"Sign\",VLOOKUP($G77,'Pick Lists & Data'!$A$39:$G$43,2,0),VLOOKUP($G77,'Pick Lists & Data'!$A$11:$H$25,2,0)))","v":0},{"$f":"$D$77+($D$78-$D$77)*0.5*$D$97","v":14.710848},{"$f":"IF($F77=\"Wire\",0,IF($F77=\"Sign\",VLOOKUP($G77,'Pick Lists & Data'!$A$39:$G$43,6,0),VLOOKUP($G77,'Pick Lists & Data'!$A$11:$H$25,6,0)))","v":0},{"$f":"$D$77+($D$78-$D$77)*0.5*$D$98","v":10.8},{"$f":"IF($F77=\"Wire\",0,IF($F77=\"Sign\",VLOOKUP($G77,'Pick Lists & Data'!$A$39:$G$43,7,0),VLOOKUP($G77,'Pick Lists & Data'!$A$11:$H$25,8,0)))","v":0}]
[2,18,"0.5\"",{"$f":"IF($E79=0,0,IF($E78<$C$21,(($E78-$E77)*0.5+($E79-$E78)*0.5)*$D$96,(($E78-$E77)*0.5+($E79-E$78))*$D$96))","v":9},{"$f":"IF(F78=\"Wire\",0,IF(F78=\"Sign\",VLOOKUP(G78,'Pick Lists & Data'!$A$39:$G$43,2,0),VLOOKUP(G78,'Pick Lists & Data'!$A$11:$H$25,2,0)))","v":0},{"$f":"IF($E79=0,0,IF($E78<$C$21,(($E78-$E77)*0.5+($E79-$E78)*0.5)*$D$97,(($E78-$E77)*0.5+($E79-G$78))*$D$97))","v":11.421696000000001},{"$f":"IF($F78=\"Wire\",0,IF($F78=\"Sign\",VLOOKUP($G78,'Pick Lists & Data'!$A$39:$G$43,6,0),VLOOKUP($G78,'Pick Lists & Data'!$A$11:$H$25,6,0)))","v":0},{"$f":"IF($E79=0,0,IF($E78<$C$21,(($E78-$E77)*0.5+($E79-$E78)*0.5)*$D$98,(($E78-$E77)*0.5+($E79-E$102))*$D$98))","v":3.6},{"$f":"IF($F78=\"Wire\",0,IF($F78=\"Sign\",VLOOKUP($G78,'Pick Lists & Data'!$A$39:$G$43,7,0),VLOOKUP($G78,'Pick Lists & Data'!$A$11:$H$25,8,0)))","v":0}]
[3,27,"96\" x 32\"",16,{"$f":"IF(F79=\"Wire\",0,IF(F79=\"Sign\",VLOOKUP(G79,'Pick Lists & Data'!$A$39:$G$43,2,0),VLOOKUP(G79,'Pick Lists & Data'!$A$11:$H$25,2,0)))","v":106},20.305237333333334,{"$f":"IF($F79=\"Wire\",0,IF($F79=\"Sign\",VLOOKUP($G79,'Pick Lists & Data'!$A$39:$G$43,6,0),VLOOKUP($G79,'Pick Lists & Data'!$A$11:$H$25,6,0)))","v":708.72662015999992},6.4,{"$f":"IF($F79=\"Wire\",0,IF($F79=\"Sign\",VLOOKUP($G79,'Pick Lists & Data'!$A$39:$G$43,7,0),VLOOKUP($G79,'Pick Lists & Data'!$A$11:$H$25,8,0)))","v":63.989999999999995}]
[4,50,"A-3",22.5,{"$f":"IF(F80=\"Wire\",0,IF(F80=\"Sign\",VLOOKUP(G80,'Pick Lists & Data'!$A$39:$G$43,2,0),VLOOKUP(G80,'Pick Lists & Data'!$A$11:$H$25,2,0)))","v":70},28.55424,{"$f":"IF($F80=\"Wire\",0,IF($F80=\"Sign\",VLOOKUP($G80,'Pick Lists & Data'!$A$39:$G$43,6,0),VLOOKUP($G80,'Pick Lists & Data'!$A$11:$H$25,6,0)))","v":291.06634751999997},9,{"$f":"IF($F80=\"Wire\",0,IF($F80=\"Sign\",VLOOKUP($G80,'Pick Lists & Data'!$A$39:$G$43,7,0),VLOOKUP($G80,'Pick Lists & Data'!$A$11:$H$25,8,0)))","v":58.56}]
[5,72,"A-3",20,{"$f":"IF(F81=\"Wire\",0,IF(F81=\"Sign\",VLOOKUP(G81,'Pick Lists & Data'!$A$39:$G$43,2,0),VLOOKUP(G81,'Pick Lists & Data'!$A$11:$H$25,2,0)))","v":70},25.381546666666669,{"$f":"IF($F81=\"Wire\",0,IF($F81=\"Sign\",VLOOKUP($G81,'Pick Lists & Data'!$A$39:$G$43,6,0),VLOOKUP($G81,'Pick Lists & Data'!$A$11:$H$25,6,0)))","v":291.06634751999997},8,{"$f":"IF($F81=\"Wire\",0,IF($F81=\"Sign\",VLOOKUP($G81,'Pick Lists & Data'!$A$39:$G$43,7,0),VLOOKUP($G81,'Pick Lists & Data'!$A$11:$H$25,8,0)))","v":58.56}]
[6,90,"30\" x 36\"",11.5,{"$f":"IF(F82=\"Wire\",0,IF(F82=\"Sign\",VLOOKUP(G82,'Pick Lists & Data'!$A$39:$G$43,2,0),VLOOKUP(G82,'Pick Lists & Data'!$A$11:$H$25,2,0)))","v":39},14.594389333333334,{"$f":"IF($F82=\"Wire\",0,IF($F82=\"Sign\",VLOOKUP($G82,'Pick Lists & Data'!$A$39:$G$43,6,0),VLOOKUP($G82,'Pick Lists & Data'!$A$11:$H$25,6,0)))","v":247.12396799999999},4.6000000000000005,{"$f":"IF($F82=\"Wire\",0,IF($F82=\"Sign\",VLOOKUP($G82,'Pick Lists & Data'!$A$39:$G$43,7,0),VLOOKUP($G82,'Pick Lists & Data'!$A$11:$H$25,8,0)))","v":22.5}]
[7,95,"A-3",15,{"$f":"IF(F83=\"Wire\",0,IF(F83=\"Sign\",VLOOKUP(G83,'Pick Lists & Data'!$A$39:$G$43,2,0),VLOOKUP(G83,'Pick Lists & Data'!$A$11:$H$25,2,0)))","v":70},19.036160000000002,{"$f":"IF($F83=\"Wire\",0,IF($F83=\"Sign\",VLOOKUP($G83,'Pick Lists & Data'!$A$39:$G$43,6,0),VLOOKUP($G83,'Pick Lists & Data'!$A$11:$H$25,6,0)))","v":291.06634751999997},6,{"$f":"IF($F83=\"Wire\",0,IF($F83=\"Sign\",VLOOKUP($G83,'Pick Lists & Data'!$A$39:$G$43,7,0),VLOOKUP($G83,'Pick Lists & Data'!$A$11:$H$25,8,0)))","v":58.56}]
[8,120,"A-5",15,{"$f":"IF(F84=\"Wire\",0,IF(F84=\"Sign\",VLOOKUP(G84,'Pick Lists & Data'!$A$39:$G$43,2,0),VLOOKUP(G84,'Pick Lists & Data'!$A$11:$H$25,2,0)))","v":97},19.036160000000002,{"$f":"IF($F84=\"Wire\",0,IF($F84=\"Sign\",VLOOKUP($G84,'Pick Lists & Data'!$A$39:$G$43,6,0),VLOOKUP($G84,'Pick Lists & Data'!$A$11:$H$25,6,0)))","v":461.51958528},6,{"$f":"IF($F84=\"Wire\",0,IF($F84=\"Sign\",VLOOKUP($G84,'Pick Lists & Data'!$A$39:$G$43,7,0),VLOOKUP($G84,'Pick Lists & Data'!$A$11:$H$25,8,0)))","v":89.34}]
[9,125,"30\" x 36\"",6.875,{"$f":"IF(F85=\"Wire\",0,IF(F85=\"Sign\",VLOOKUP(G85,'Pick Lists & Data'!$A$39:$G$43,2,0),VLOOKUP(G85,'Pick Lists & Data'!$A$11:$H$25,2,0)))","v":39},8.7249066666666675,{"$f":"IF($F85=\"Wire\",0,IF($F85=\"Sign\",VLOOKUP($G85,'Pick Lists & Data'!$A$39:$G$43,6,0),VLOOKUP($G85,'Pick Lists & Data'!$A$11:$H$25,6,0)))","v":247.12396799999999},2.75,{"$f":"IF($F85=\"Wire\",0,IF($F85=\"Sign\",VLOOKUP($G85,'Pick Lists & Data'!$A$39:$G$43,7,0),VLOOKUP($G85,'Pick Lists & Data'!$A$11:$H$25,8,0)))","v":22.5}]
[10,133.75,"0.5\"",8.75,{"$f":"IF(F86=\"Wire\",0,IF(F86=\"Sign\",VLOOKUP(G86,'Pick Lists & Data'!$A$39:$G$43,2,0),VLOOKUP(G86,'Pick Lists & Data'!$A$11:$H$25,2,0)))","v":0},11.104426666666667,{"$f":"IF($F86=\"Wire\",0,IF($F86=\"Sign\",VLOOKUP($G86,'Pick Lists & Data'!$A$39:$G$43,6,0),VLOOKUP($G86,'Pick Lists & Data'!$A$11:$H$25,6,0)))","v":0},3.5,{"$f":"IF($F86=\"Wire\",0,IF($F86=\"Sign\",VLOOKUP($G86,'Pick Lists & Data'!$A$39:$G$43,7,0),VLOOKUP($G86,'Pick Lists & Data'!$A$11:$H$25,8,0)))","v":0}]
[11,142.5,"0.5\"",8.75,{"$f":"IF(F87=\"Wire\",0,IF(F87=\"Sign\",VLOOKUP(G87,'Pick Lists & Data'!$A$39:$G$43,2,0),VLOOKUP(G87,'Pick Lists & Data'!$A$11:$H$25,2,0)))","v":0},11.104426666666667,{"$f":"IF($F87=\"Wire\",0,IF($F87=\"Sign\",VLOOKUP($G87,'Pick Lists & Data'!$A$39:$G$43,6,0),VLOOKUP($G87,'Pick Lists & Data'!$A$11:$H$25,6,0)))","v":0},3.5,{"$f":"IF($F87=\"Wire\",0,IF($F87=\"Sign\",VLOOKUP($G87,'Pick Lists & Data'!$A$39:$G$43,7,0),VLOOKUP($G87,'Pick Lists & Data'!$A$11:$H$25,8,0)))","v":0}]
[12,151.25,"0.5\"",8.75,{"$f":"IF(F88=\"Wire\",0,IF(F88=\"Sign\",VLOOKUP(G88,'Pick Lists & Data'!$A$39:$G$43,2,0),VLOOKUP(G88,'Pick Lists & Data'!$A$11:$H$25,2,0)))","v":0},11.104426666666667,{"$f":"IF($F88=\"Wire\",0,IF($F88=\"Sign\",VLOOKUP($G88,'Pick Lists & Data'!$A$39:$G$43,6,0),VLOOKUP($G88,'Pick Lists & Data'!$A$11:$H$25,6,0)))","v":0},3.5,{"$f":"IF($F88=\"Wire\",0,IF($F88=\"Sign\",VLOOKUP($G88,'Pick Lists & Data'!$A$39:$G$43,7,0),VLOOKUP($G88,'Pick Lists & Data'!$A$11:$H$25,8,0)))","v":0}]
[13,160,"0.5\"",0,{"$f":"IF(F89=\"Wire\",0,IF(F89=\"Sign\",VLOOKUP(G89,'Pick Lists & Data'!$A$39:$G$43,2,0),VLOOKUP(G89,'Pick Lists & Data'!$A$11:$H$25,2,0)))","v":0},0,{"$f":"IF($F89=\"Wire\",0,IF($F89=\"Sign\",VLOOKUP($G89,'Pick Lists & Data'!$A$39:$G$43,6,0),VLOOKUP($G89,'Pick Lists & Data'!$A$11:$H$25,6,0)))","v":0},0,{"$f":"IF($F89=\"Wire\",0,IF($F89=\"Sign\",VLOOKUP($G89,'Pick Lists & Data'!$A$39:$G$43,7,0),VLOOKUP($G89,'Pick Lists & Data'!$A$11:$H$25,8,0)))","v":0}]
[14,0,"None",0,{"$f":"IF(F90=\"Wire\",0,IF(F90=\"Sign\",VLOOKUP(G90,'Pick Lists & Data'!$A$39:$G$43,2,0),VLOOKUP(G90,'Pick Lists & Data'!$A$11:$H$25,2,0)))","v":0},0,{"$f":"IF($F90=\"Wire\",0,IF($F90=\"Sign\",VLOOKUP($G90,'Pick Lists & Data'!$A$39:$G$43,6,0),VLOOKUP($G90,'Pick Lists & Data'!$A$11:$H$25,6,0)))","v":0},0,{"$f":"IF($F90=\"Wire\",0,IF($F90=\"Sign\",VLOOKUP($G90,'Pick Lists & Data'!$A$39:$G$43,7,0),VLOOKUP($G90,'Pick Lists & Data'!$A$11:$H$25,8,0)))","v":0}]
[15,0,"None",{"$f":"IF($T162=0,0,IF($E91<$C$21,(($E91-$E90)*0.5+($T162-$E91)*0.5)*$D$96,(($E91-$E90)*0.5+($T162-E$78))*$D$96))","v":0},{"$f":"IF(F91=\"Wire\",0,IF(F91=\"Sign\",VLOOKUP(G91,'Pick Lists & Data'!$A$39:$G$43,2,0),VLOOKUP(G91,'Pick Lists & Data'!$A$11:$H$25,2,0)))","v":0},{"$f":"IF($T162=0,0,IF($E91<$C$21,(($E91-$E90)*0.5+($T162-$E91)*0.5)*$D$97,(($E91-$E90)*0.5+($T162-G$78))*$D$97))","v":0},{"$f":"IF($F91=\"Wire\",0,IF($F91=\"Sign\",VLOOKUP($G91,'Pick Lists & Data'!$A$39:$G$43,6,0),VLOOKUP($G91,'Pick Lists & Data'!$A$11:$H$25,6,0)))","v":0},{"$f":"IF($T162=0,0,IF($E91<$C$21,(($E91-$E90)*0.5+($T162-$E91)*0.5)*$D$98,(($E91-$E90)*0.5+($T162-E$102))*$D$98))","v":0},{"$f":"IF($F91=\"Wire\",0,IF($F91=\"Sign\",VLOOKUP($G91,'Pick Lists & Data'!$A$39:$G$43,7,0),VLOOKUP($G91,'Pick Lists & Data'!$A$11:$H$25,8,0)))","v":0}]
[]
["Place Distances and Loads into table for span wire analysis"]
[]
[null,"Loading Final Rank","Distance (Xn)","Dead Load","Wind Load","Ice Load","Load Description","Signal Config/Sign Size/Wire Diameter"]
[null,1,{"$f":"B101","v":9},{"$f":"SUM(D101:E101)","v":13.5},{"$f":"SUM(F101:G101)","v":14.710848},{"$f":"SUM(H101:I101)","v":10.8},{"$f":"F77","v":"Wire"},{"$f":"C101","v":"0.5\""}]
[null,2,{"$f":"B102","v":18},{"$f":"SUM(D102:E102)","v":9},{"$f":"SUM(F102:G102)","v":11.421696000000001},{"$f":"SUM(H102:I102)","v":3.6},"Wire",{"$f":"C102","v":"0.5\""}]
[null,3,27,122,729.03185749333329,70.39,"Sign","96\" x 32\""]
[null,4,50,92.5,319.62058751999996,67.56,"Signal","A-3"]
[null,5,72,90,316.44789418666664,66.56,"Signal","A-3"]
[null,6,90,50.5,261.7183573333333,27.1,"Sign","30\" x 36\""]
[null,7,95,85,310.10250751999996,64.56,"Signal","A-3"]
[null,8,120,112,480.55574528,95.34,"Signal","A-5"]
[null,9,125,45.875,255.84887466666666,25.25,"Sign","30\" x 36\""]
[null,10,133.75,8.75,11.104426666666667,3.5,"Wire","0.5\""]
[null,11,142.5,8.75,11.104426666666667,3.5,"Wire","0.5\""]
[null,12,151.25,8.75,11.104426666666667,3.5,"Wire","0.5\""]
[null,13,160,0,0,0,"Wire","0.5\""]
[null,14,0,0,0,0,"Sign","None"]
[null,15,0,0,0,0,"Sign","None"]
[null,null,null,{"$f":"SUM(D120:D134)","v":646.625},{"$f":"SUM(E120:E134)","v":2732.7716480000004}]
[]
[null,"* Distances MUST be entered in order, starting with the load closest to Support 1 and moving"]
[null,"right towards Support 2.  If all 14 loads are not used, a \"null distance\" and a \"null load\" must be "]
[null,"assigned to the worksheet cell (ie. Enter a zero for each null value.)"]
[]
["Dead Load (Group I Loading, also used for Groups II and III)"]
[]
["Calculate Dead Load Reactions:"]
[null,"Summing moments about Support 2 (Counter clockwise-moments positive):"]
[]
[null,"Loading","Dead Load","Arm","Moment"]
[null,{"$f":"B120","v":1},{"$f":"D120","v":13.5},{"$f":"C120","v":9},{"$f":"C147*D147","v":121.5}]
[null,2,9,18,162]
[null,3,122,27,3294]
[null,4,92.5,50,4625]
[null,5,90,72,6480]
[null,6,50.5,90,4545]
[null,7,85,95,8075]
[null,8,112,120,13440]
[null,9,45.875,125,5734.375]
[null,10,8.75,133.75,1170.3125]
[null,11,8.75,142.5,1246.875]
[null,12,8.75,151.25,1323.4375]
[null,13,0,160,0]
[null,14,0,0,0]
[null,15,0,0,0]
[]
[null,"S MomentsSupport 2 = 0 = [(S Loadn * Xn)] - (R Support 1 * Length)"]
[null,"R Support 1 =",{"$f":"(SUM(E147:E161)/C21)","v":313.859375},"lbs"]
[]
[null,"S Forcey = 0 = R Support 2 + R Support 1 - (S Loadn)"]
[null,"R Support 2 =",{"$f":"(SUM(C147:C161))-C164","v":332.765625},"lbs"]
[]
["Dead Load Shear Diagram:"]
[null,"Location","Distance","Load / Reaction","Shear 1","Shear 2"]
[null,"Support 2",0,{"$f":"C167","v":332.765625},{"$f":"0","v":0},{"$f":"E171+C167","v":332.765625},{"$f":"IF(AND(E171>=0,F171>=0),\"+ / +\",IF(AND(E171<=0,F171<=0),\"- / -\",\"+ / -\"))","v":"+ / +"},{"$f":"IF(G171=\"+ / -\",\"Low Point\",\"\")","v":""},{"$f":"IF(H171=\"Low Point\",C171,\" \")","v":" "}]
[null,{"$f":"B120","v":1},9,13.5,{"$f":"IF(D172>0,F171,\" \")","v":332.765625},{"$f":"IF(D171>0,E172-D172,\" \")","v":319.265625},{"$f":"IF(AND(E172>=0,F172>=0),\"+ / +\",IF(AND(E172<=0,F172<=0),\"- / -\",\"+ / -\"))","v":"+ / +"},{"$f":"IF(G172=\"+ / -\",\"Low Point\",\"\")","v":""},{"$f":"IF(H172=\"Low Point\",C172,\" \")","v":" "}]
[null,2,18,9,{"$f":"F172","v":319.265625},{"$f":"E173-D173","v":310.265625},"+ / +",""," "]
[null,3,27,122,{"$f":"F173","v":310.265625},{"$f":"E174-D174","v":188.265625},{"$f":"IF(AND(E174>=0,F174>=0),\"+ / +\",IF(AND(E174<=0,F174<=0),\"- / -\",\"+ / -\"))","v":"+ / +"},{"$f":"IF(G174=\"+ / -\",\"Low Point\",\"\")","v":""},{"$f":"IF(H174=\"Low Point\",C174,\" \")","v":" "}]
[null,4,50,92.5,{"$f":"F174","v":188.265625},{"$f":"E175-D175","v":95.765625},"+ / +",{"$f":"IF(G175=\"+ / -\",\"Low Point\",\"\")","v":""}," "]
[null,5,72,90,{"$f":"F175","v":95.765625},5.765625,"+ / +",""," "]
[null,6,90,50.5,5.765625,-44.734375,"+ / -","Low Point",90]
[null,7,95,85,-44.734375,-129.734375,"- / -",""," "]
[null,8,120,112,-129.734375,-241.734375,"- / -",""," "]
[null,9,125,45.875,-241.734375,-287.609375,"- / -",""," "]
[null,10,133.75,8.75,-287.609375,-296.359375,"- / -",""," "]
[null,11,142.5,8.75,-296.359375,-305.109375,"- / -",""," "]
[null,12,151.25,8.75,-305.109375,-313.859375,"- / -",""," "]
[null,13,160,0,-313.859375,-313.859375,"- / -",""," "]
[null,14,0,0,-313.859375,-313.859375,"- / -",""," "]
[null,15,0,0,-313.859375,-313.859375,"- / -",""," "]
[null,"Support 1",{"$f":"C21","v":160},{"$f":"C164","v":313.859375},{"$f":"F186","v":-313.859375},{"$f":"E187+D187","v":0},"- / -",""," "]
[]
[null,"The Low Point occurs at:",null,{"$f":"MAX(I171:I187)","v":90},"feet from Support 2"]
["Calculation: Sum Moments about Low Point to Determine Horizontal Reaction:"]
[]
[null,"Maximum Allowable Sag:",null,{"$f":"(G21/100)*C21","v":8},"feet"]
[null,"Summing Moments about the Low point (Counter-Clockwise Positive):"]
[]
[null,"Location","Distance from Low Point","Load","Moment"]
[null,"Support 2",{"$f":"D189","v":90},{"$f":"D171","v":332.765625},{"$f":"C196*D196","v":29948.90625}]
[null,{"$f":"B120","v":1},{"$f":"IF(C172=0,0,IF(C172<$D$189,($D$189-C172),0))","v":81},13.5,{"$f":"-C197*D197","v":-1093.5}]
[null,2,72,9,{"$f":"-C198*D198","v":-648}]
[null,3,63,122,{"$f":"-C199*D199","v":-7686}]
[null,4,40,92.5,{"$f":"-C200*D200","v":-3700}]
[null,5,18,90,{"$f":"-C201*D201","v":-1620}]
[null,6,0,50.5,0]
[null,7,0,85,0]
[null,8,0,112,0]
[null,9,0,45.875,0]
[null,10,0,8.75,0]
[null,11,0,8.75,0]
[null,12,0,8.75,0]
[null,13,0,0,0]
[null,14,0,0,0]
[null,15,0,0,0]
[null,"Support 1",0,313.859375,0]
[]
[null,"Determine Horizontal force:"]
[null,"H = ",{"$f":"ABS(SUM(E196:E212)/D192)","v":1900.17578125},"lbs"]
[]
["Calculate Actual Length of Cable (Accounting for sag, Dead Load Only):"]
[null,"Fy = Shear 2, calculated above."]
[]
[null,"Location","Fy","xi","Length of Segment"]
[null,"Support 1"]
[null,{"$f":"B120","v":1},{"$f":"E172","v":332.765625},{"$f":"IF(B222<($G$6+1),((C172-C171)),(IF(B222=($G$6+1),(($C$187-C171)),0)))","v":9},{"$f":"SQRT($C$215^2+C222^2)*(D222/$C$215)","v":9.13696504976601}]
[null,2,{"$f":"E173","v":319.265625},9,{"$f":"SQRT($C$215^2+C223^2)*(D223/$C$215)","v":9.1261525845161735}]
[null,3,310.265625,9,9.1191862338456353]
[null,4,188.265625,23,23.112613495403554]
[null,5,95.765625,22,22.0279221534512]
[null,6,5.765625,18,18.000082860345007]
[null,7,-44.734375,5,5.0013853995327384]
[null,8,-129.734375,25,25.058200585549539]
[null,9,-241.734375,5,5.0402979242575769]
[null,10,-287.609375,8.75,8.8496621597728602]
[null,11,-296.359375,8.75,8.8557817084063242]
[null,12,-305.109375,8.75,8.8620802261471727]
[null,13,-313.859375,8.75,8.8685573316797015]
[null,14,-313.859375,0,0]
[null,15,-313.859375,0,0]
[null,"Support 2",-313.859375,0,0]
[]
[null,null,null,"Total Length =",{"$f":"SUM(E221:E237)","v":161.05888771267348}]
["Wind Loading"]
[]
["Calculate Reactions at each support:"]
[]
[null,"Summing moments about Support 2 (Clockwise moments positive):"]
[]
[null,"Loading","Wind Load","Arm","Moment"]
[null,{"$f":"B120","v":1},{"$f":"E120","v":14.710848},{"$f":"C120","v":9},{"$f":"C247*D247","v":132.39763200000002}]
[null,2,11.421696000000001,18,{"$f":"C248*D248","v":205.59052800000001}]
[null,3,729.03185749333329,27,19683.860152319998]
[null,4,319.62058751999996,50,15981.029375999999]
[null,5,316.44789418666664,72,22784.248381439997]
[null,6,261.7183573333333,90,23554.652159999998]
[null,7,310.10250751999996,95,29459.738214399997]
[null,8,480.55574528,120,57666.689433599997]
[null,9,255.84887466666666,125,31981.109333333334]
[null,10,11.104426666666667,133.75,1485.2170666666666]
[null,11,11.104426666666667,142.5,1582.3808000000001]
[null,12,11.104426666666667,151.25,1679.5445333333334]
[null,13,0,160,0]
[null,14,0,0,0]
[null,15,0,0,0]
[]
[null,"S MomentsSupport 2 = 0 = [(S Loadn * Xn)] - (R Support 1 * Length)"]
[null,"R Support 1 =",{"$f":"(SUM(E247:E261)/C21)","v":1288.7278600693332},"lbs"]
[]
[null,"S Forcey = 0 = R Support 2 + R Support 1 - (S Loadn)"]
[null,"R Support 2 =",{"$f":"(SUM(C247:C261))-C264","v":1444.0437879306671},"lbs"]
[]
["Wind Load Shear Diagram:"]
[null,"Location","Distance","Load / Reaction","Shear 1","Shear 2"]
[null,"Support 2",0,{"$f":"C267","v":1444.0437879306671},{"$f":"0","v":0},{"$f":"E271+C267","v":1444.0437879306671}]
[null,{"$f":"B222","v":1},{"$f":"C120","v":9},{"$f":"E120","v":14.710848},{"$f":"IF(D272>0,F271,\" \")","v":1444.0437879306671},{"$f":"IF(D271>0,E272-D272,\" \")","v":1429.3329399306672}]
[null,2,18,11.421696000000001,{"$f":"F272","v":1429.3329399306672},{"$f":"E273-D273","v":1417.9112439306671}]
[null,3,27,729.03185749333329,1417.9112439306671,688.87938643733378]
[null,4,50,319.62058751999996,688.87938643733378,369.25879891733382]
[null,5,72,316.44789418666664,369.25879891733382,52.810904730667175]
[null,6,90,261.7183573333333,52.810904730667175,-208.90745260266613]
[null,7,95,310.10250751999996,-208.90745260266613,-519.00996012266614]
[null,8,120,480.55574528,-519.00996012266614,-999.56570540266614]
[null,9,125,255.84887466666666,-999.56570540266614,-1255.4145800693327]
[null,10,133.75,11.104426666666667,-1255.4145800693327,-1266.5190067359995]
[null,11,142.5,11.104426666666667,-1266.5190067359995,-1277.6234334026663]
[null,12,151.25,11.104426666666667,-1277.6234334026663,-1288.727860069333]
[null,13,160,0,-1288.727860069333,-1288.727860069333]
[null,14,0,0,-1288.727860069333,-1288.727860069333]
[null,15,0,0,-1288.727860069333,-1288.727860069333]
[null,"Support 1",{"$f":"C21","v":160},{"$f":"C264","v":1288.7278600693332},{"$f":"F286","v":-1288.727860069333},{"$f":"E287+D287","v":0}]
[]
[]
["Ice Load"]
[]
["Calculate Reactions at each support:"]
[]
[null,"Summing moments about Support 2 (Clockwise moments positive):"]
[]
[null,"Loading","Ice Load","Arm","Moment"]
[null,{"$f":"B120","v":1},{"$f":"F120","v":10.8},{"$f":"C120","v":9},{"$f":"C297*D297","v":97.2}]
[null,2,3.6,18,{"$f":"C298*D298","v":64.8}]
[null,3,70.39,27,1900.53]
[null,4,67.56,50,3378]
[null,5,66.56,72,4792.32]
[null,6,27.1,90,2439]
[null,7,64.56,95,6133.2]
[null,8,95.34,120,11440.800000000001]
[null,9,25.25,125,3156.25]
[null,10,3.5,133.75,468.125]
[null,11,3.5,142.5,498.75]
[null,12,3.5,151.25,529.375]
[null,13,0,160,0]
[null,14,0,0,0]
[null,15,0,0,0]
[]
[null,"S MomentsSupport 2 = 0 = [(S Loadn * Xn)] - (R Support 1 * Length)"]
[null,"R Support 1 =",{"$f":"(SUM(E297:E311)/C21)","v":218.1146875},"lbs"]
[]
[null,"S Forcey = 0 = R Support 2 + R Support 1 - (S Loadn)"]
[null,"R Support 2 =",{"$f":"(SUM(C297:C311))-C314","v":223.54531250000008},"lbs"]
[]
["Ice Load Shear Diagram:"]
[null,"Location","Distance","Load / Reaction","Shear 1","Shear 2"]
[null,"Support 2",{"$f":"0","v":0},{"$f":"C317","v":223.54531250000008},0,{"$f":"E321+C317","v":223.54531250000008}]
[null,{"$f":"B120","v":1},9,{"$f":"F120","v":10.8},{"$f":"IF(D322>0,F321,\" \")","v":223.54531250000008},{"$f":"IF(D321>0,E322-D322,\" \")","v":212.74531250000007}]
[null,2,18,3.6,{"$f":"F322","v":212.74531250000007},{"$f":"E323-D323","v":209.14531250000007}]
[null,3,27,70.39,209.14531250000007,138.75531250000006]
[null,4,50,67.56,138.75531250000006,71.195312500000057]
[null,5,72,66.56,71.195312500000057,4.6353125000000546]
[null,6,90,27.1,4.6353125000000546,-22.464687499999947]
[null,7,95,64.56,-22.464687499999947,-87.024687499999942]
[null,8,120,95.34,-87.024687499999942,-182.36468749999995]
[null,9,125,25.25,-182.36468749999995,-207.61468749999995]
[null,10,133.75,3.5,-207.61468749999995,-211.11468749999995]
[null,11,142.5,3.5,-211.11468749999995,-214.61468749999995]
[null,12,151.25,3.5,-214.61468749999995,-218.11468749999995]
[null,13,160,0,-218.11468749999995,-218.11468749999995]
[null,14,0,0,-218.11468749999995,-218.11468749999995]
[null,15,0,0,-218.11468749999995,-218.11468749999995]
[null,"Support 1",{"$f":"C21","v":160},{"$f":"C314","v":218.1146875},{"$f":"IF(D337>0,F336,\" \")","v":-218.11468749999995},{"$f":"E337+D337","v":0}]
[]
["Determine Fx - Group II (Dead + Wind)"]
[]
[null,"Value for Fx:",1693.4006597319199,null,"Fx2 =",{"$f":"C341*C341","v":2867605.7943805014}]
[]
[null,"Location","Fyi","Fyi2","Fzi","Fzi2","xi","Vector Component"]
[null,{"$f":"B120","v":1},{"$f":"F171","v":332.765625},{"$f":"C344*C344","v":110732.96118164063},{"$f":"F271","v":1444.0437879306671},{"$f":"E344*E344","v":2085262.4614611496},{"$f":"D222","v":9},{"$f":"(($F$341+D344+F344)^(0.5))*(G344/$C$341)","v":11.959486491221133}]
[null,2,319.265625,{"$f":"C345*C345","v":101930.53930664063},1429.3329399306672,{"$f":"E345*E345","v":2042992.6531708443},9,{"$f":"(($F$341+D345+F345)^(0.5))*(G345/$C$341)","v":11.899021064964129}]
[null,3,310.265625,96264.758056640625,1417.9112439306671,2010472.2956650117,9,11.853610219393252]
[null,4,188.265625,35443.945556640625,688.87938643733378,474554.80905827746,23,24.961605305942914]
[null,5,95.765625,9171.054931640625,369.25879891733382,136352.06057787198,22,22.551311940602087]
[null,6,5.765625,33.242431640625,52.810904730667175,2788.9916584716048,18,18.008855422310354]
[null,7,-44.734375,2001.164306640625,-208.90745260266613,43642.323752935197,5,5.0396352362239147]
[null,8,-129.734375,16831.008056640625,-519.00996012266614,269371.3387065315,25,26.217900986795936]
[null,9,-241.734375,58435.508056640625,-999.56570540266614,999131.59941712953,5,5.8497819173534253]
[null,10,-287.609375,82719.152587890625,-1255.4145800693327,1576065.7678506591,8.75,10.993205538797985]
[null,11,-296.359375,87828.879150390625,-1266.5190067359995,1604070.3944235428,8.75,11.033344529874157]
[null,12,-305.109375,93091.730712890625,-1277.6234334026663,1632321.6375796171,8.75,11.073819925974425]
[null,13,-313.859375,98507.707275390625,-1288.727860069333,1660819.4973188825,8.75,11.114628051908506]
[null,14,-313.859375,98507.707275390625,-1288.727860069333,1660819.4973188825,0,0]
[null,15,-313.859375,98507.707275390625,-1288.727860069333,1660819.4973188825,0,0]
[null,null,null,null,null,null,"Total:",{"$f":"SUM(H344:H358)","v":182.55620663136224}]
[null,null,"Actual Length :",null,{"$f":"E239","v":161.05888771267348}]
[null,null,"Percentage Difference:",null,{"$f":"(ABS(H359-E360)/E360)*100","v":13.347489992008166},"%*"]
[]
[null,"* The Percentage Difference should be 0.00 % "]
[]
[]
["Determine Fx - Group III (Dead + Ice + 0.5 · Wind)"]
[]
[null,"Value for Fx:",1208.8702142936243,null,"Fx2 =",{"$f":"C368*C368","v":1461367.195006313}]
[]
[null,"Location","Fyi","Fyi2","Fzi","Fzi2","xi","Vector Component"]
[null,{"$f":"B120","v":1},{"$f":"F171+F321","v":556.31093750000014},{"$f":"C371*C371","v":309481.85918212903},{"$f":"0.5*F271","v":722.02189396533356},{"$f":"E371*E371","v":521315.61536528741},{"$f":"D222","v":9},{"$f":"(($F$368+D371+F371)^(0.5))*(G371/$C$368)","v":11.271604442206796}]
[null,2,{"$f":"F172+F322","v":532.01093750000007},{"$f":"C372*C372","v":283035.63761962898},{"$f":"0.5*F272","v":714.66646996533359},{"$f":"E372*E372","v":510748.16329271108},{"$f":"D223","v":9},{"$f":"(($F$368+D372+F372)^(0.5))*(G372/$C$368)","v":11.180227615674745}]
[null,3,519.41093750000005,269787.72199462896,708.95562196533353,502618.07391625294,9,11.127109199832967]
[null,4,327.02093750000006,106942.69356337894,344.43969321866689,118638.70226456937,23,24.71149856809749]
[null,5,166.96093750000006,27875.954650878924,184.62939945866691,34088.015144467994,22,22.461573022257738]
[null,6,10.400937500000055,108.17950087890739,26.405452365333588,697.24791461790119,18,18.00495963522738]
[null,7,-67.19906249999994,4515.7140008788983,-104.45372630133306,10910.580938233799,5,5.0263208969500592]
[null,8,-216.75906249999994,46984.49117587888,-259.50498006133307,67342.834676632876,25,25.959501239149372]
[null,9,-424.09906249999995,179860.01481337886,-499.78285270133307,249782.89985428238,5,5.6877074829508025]
[null,10,-495.22406249999995,245246.87207900386,-627.70729003466636,394016.44196266477,8.75,10.49066962701202]
[null,11,-507.47406249999995,257529.92411025387,-633.25950336799974,401017.59860588569,8.75,10.538712841173368]
[null,12,-519.72406249999995,270113.10114150384,-638.81171670133313,408080.40939490427,8.75,10.587433185070585]
[null,13,-531.97406249999995,282996.40317275387,-644.36393003466651,415204.87432972062,8.75,10.636821354238162]
[null,14,-531.97406249999995,282996.40317275387,-644.36393003466651,415204.87432972062,0,0]
[null,15,-531.97406249999995,282996.40317275387,-644.36393003466651,415204.87432972062,0,0]
[null,null,null,null,null,null,"Total:",{"$f":"SUM(H371:H385)","v":177.68413910984145}]
[null,null,"Actual Length :",null,{"$f":"E239","v":161.05888771267348}]
[null,null,"Percentage Difference:",null,{"$f":"(ABS(H386-E387)/E387)*100","v":10.322467535493701},"%*"]
[]
[null,"* The Percentage Difference should be 0.00 % "]
[]
[]
[]
["FINAL RESULTS:"]
[]
[null,"Span Wire Present:",{"$f":"Input!I52","v":"YES"}]
[]
["Support Reactions:"]
["Support 1 (Left)",null,null,"Support 2 (Right)",null,null,"Group Load"]
["Fx","Fy","Fz","Fx","Fy","Fz"]
[{"$f":"IF(C396=\"YES\",C215,0)","v":1900.17578125},{"$f":"IF(C396=\"YES\",C164,0)","v":313.859375},{"$f":"0","v":0},{"$f":"IF(C396=\"YES\",C215,0)","v":1900.17578125},{"$f":"IF(C396=\"YES\",C167,0)","v":332.765625},{"$f":"0","v":0},"Group I","(DL)"]
[{"$f":"IF(C396=\"YES\",C341,0)","v":1693.4006597319199},{"$f":"IF(C396=\"YES\",C164,0)","v":313.859375},{"$f":"IF(C396=\"YES\",C264,0)","v":1288.7278600693332},{"$f":"IF(C396=\"YES\",C341,0)","v":1693.4006597319199},{"$f":"IF(C396=\"YES\",C167,0)","v":332.765625},{"$f":"IF(C396=\"YES\",C267,0)","v":1444.0437879306671},"Group II","(DL + WL)"]
[{"$f":"IF(C396=\"YES\",C368,0)","v":1208.8702142936243},{"$f":"IF(C396=\"YES\",C164+C314,0)","v":531.97406249999995},{"$f":"IF(C396=\"YES\",0.5*C264,0)","v":644.36393003466662},{"$f":"IF(C396=\"YES\",C368,0)","v":1208.8702142936243},{"$f":"IF(C396=\"YES\",C167+C317,0)","v":556.31093750000014},{"$f":"IF(C396=\"YES\",0.5*C267,0)","v":722.02189396533356},"Group III","(DL + IL + 0.5 · WL)"]
[]
["Wire Tension:"]
["Support 1","Support 2","Group Load"]
[{"$f":"SQRT(A401^2+B401^2+C401^2)","v":1925.9220407182734},{"$f":"SQRT(D401^2+E401^2+F401^2)","v":1929.093300188119},"Group I","(DL)"]
[{"$f":"SQRT(A402^2+B402^2+C402^2)","v":2151.0306829459164},{"$f":"SQRT(D402^2+E402^2+F402^2)","v":2250.2447015876501},"Group II","(DL + WL)"]
[{"$f":"SQRT(A403^2+B403^2+C403^2)","v":1469.5470297029583},{"$f":"SQRT(D403^2+E403^2+F403^2)","v":1513.9896530537219},"Group III","(DL + IL + 0.5 · WL)"]

{"sheet":"P1","index":8,"n_rows":53,"n_cols":8,"rows_kept":53,"cut":false,"hidden":false,"merged":[[2,6,3,8],[13,1,13,3],[24,1,24,3],[35,1,35,3],[2,0,2,2],[2,3,2,5],[52,4,53,8],[13,4,13,5],[24,4,24,5],[35,4,35,5],[24,6,25,8],[13,6,14,8],[35,6,36,8],[49,4,49,6]]}
["P1 Reactions (Loads Due to SW4 & SW1)"]
[]
["SW4 - Support 2 (Right)",null,null,"SW1 - Support 1 (Left)",null,null,"Group Load"]
["Fx","Fy","Fz","Fx","Fy","Fz"]
[{"$f":"'SW4'!D401","v":1900.17578125},{"$f":"'SW4'!E401","v":332.765625},{"$f":"'SW4'!F401","v":0},{"$f":"'SW1'!A401","v":1759.830636209399},{"$f":"'SW1'!B401","v":249.86207450224794},{"$f":"'SW1'!C401","v":0},"Group I","(DL)"]
[{"$f":"'SW4'!D402","v":1693.4006597319199},{"$f":"'SW4'!E402","v":332.765625},{"$f":"'SW4'!F402","v":1444.0437879306671},{"$f":"'SW1'!A402","v":3804.8368981276994},{"$f":"'SW1'!B402","v":249.86207450224794},{"$f":"'SW1'!C402","v":876.55718433431832},"Group II","(DL + WL)"]
[{"$f":"'SW4'!D403","v":1208.8702142936243},{"$f":"'SW4'!E403","v":556.31093750000014},{"$f":"'SW4'!F403","v":722.02189396533356},{"$f":"'SW1'!A403","v":2468.3083891027918},{"$f":"'SW1'!B403","v":415.77330122029548},{"$f":"'SW1'!C403","v":438.27859216715916},"Group III","(DL + IL + 0.5 · WL)"]
[]
["Case 1 Wind at 90˚ to SW4"]
["FX = 1.0 · FX SW4 + 0.0 · FZ SW1"]
["FY = 1.0 · FY SW4 + 1.0 · FY SW1"]
["Fz = 1.0 · FX SW1 + 1.0 · FZ SW4  + 0.2 FZ SW1"]
[]
[null,"Pole Reactions",null,null,"Resultants",null,"Group Load"]
[null,"Fx","Fy","Fz","Horizontal","Vertical"]
[null,{"$f":"A5+0*F5","v":1900.17578125},{"$f":"B5+E5","v":582.62769950224788},{"$f":"1*D5+1*C5+0.2*F5","v":1759.830636209399},{"$f":"SQRT(B16^2+D16^2)","v":2589.9173476754477},{"$f":"C16","v":582.62769950224788},"Group I","(DL)"]
[null,{"$f":"A6+0*F6","v":1693.4006597319199},{"$f":"B6+E6","v":582.62769950224788},{"$f":"1*D6+1*C6+0.2*F6","v":5424.1921229252303},{"$f":"SQRT(B17^2+D17^2)","v":5682.3820692368636},{"$f":"C17","v":582.62769950224788},"Group II","(DL + WL)"]
[null,{"$f":"A7+0*F7","v":1208.8702142936243},{"$f":"B7+E7","v":972.08423872029562},{"$f":"1*D7+1*C7+0.2*F7","v":3277.9860015015574},{"$f":"SQRT(B18^2+D18^2)","v":3493.788691527649},{"$f":"C18","v":972.08423872029562},"Group III","(DL + IL + 0.5 · WL)"]
[]
["Case 2 Wind at 90˚ to SW1"]
["FX = 1.0 · FX SW4 + 1.0 · FZ SW1 + 0.2 · FZ SW4"]
["FY = 1.0 · FY SW4 + 1.0 · FY SW1"]
["Fz = 1.0 · FX SW1  + 0.0 · FZ SW4"]
[]
[null,"Pole Reactions",null,null,"Resultants",null,"Group Load"]
[null,"Fx","Fy","Fz","Horizontal","Vertical"]
[null,{"$f":"A5+1*F5+0.2*C5","v":1900.17578125},{"$f":"B5+E5","v":582.62769950224788},{"$f":"D5+0*C5","v":1759.830636209399},{"$f":"SQRT(B27^2+D27^2)","v":2589.9173476754477},{"$f":"C27","v":582.62769950224788},"Group I","(DL)"]
[null,{"$f":"A6+1*F6+0.2*C6","v":2858.7666016523717},{"$f":"B6+E6","v":582.62769950224788},{"$f":"D6+0*C6","v":3804.8368981276994},{"$f":"SQRT(B28^2+D28^2)","v":4759.1312551848223},{"$f":"C28","v":582.62769950224788},"Group II","(DL + WL)"]
[null,{"$f":"A7+1*F7+0.2*C7","v":1791.5531852538502},{"$f":"B7+E7","v":972.08423872029562},{"$f":"D7+0*C7","v":2468.3083891027918},{"$f":"SQRT(B29^2+D29^2)","v":3049.9523142679518},{"$f":"C29","v":972.08423872029562},"Group III","(DL + IL + 0.5 · WL)"]
[]
["Case 3 Wind at 45˚"]
["FX = 1.0 · FX SW4 + 0.707 · FZ SW1 + 0.2 · 0.707 · FZ SW4"]
["FY = 1.0 · FY SW4 + 1.0 · FY SW1"]
["Fz = 1.0 · FX SW1  +0.707 · FZ SW4 + 0.2 · 0.707 · FZ SW1"]
[]
[null,"Pole Reactions",null,null,"Resultants",null,"Group Load"]
[null,"Fx","Fy","Fz","Horizontal","Vertical"]
[null,{"$f":"A5+0.707*F5+0.2*0.707*C5","v":1900.17578125},{"$f":"B5+E5","v":582.62769950224788},{"$f":"D5+0.707*C5+0.2*0.707*F5","v":1759.830636209399},{"$f":"SQRT(B38^2+D38^2)","v":2589.9173476754477},{"$f":"C38","v":582.62769950224788},"Group I","(DL)"]
[null,{"$f":"A6+0.707*F6+0.2*0.707*C6","v":2517.3143806696789},{"$f":"B6+E6","v":582.62769950224788},{"$f":"D6+0.707*C6+0.2*0.707*F6","v":4949.7210420595538},{"$f":"SQRT(B39^2+D39^2)","v":5553.0721303917426},{"$f":"C39","v":582.62769950224788},"Group II","(DL + WL)"]
[null,{"$f":"A7+0.707*F7+0.2*0.707*C7","v":1620.8270747625038},{"$f":"B7+E7","v":972.08423872029562},{"$f":"D7+0.707*C7+0.2*0.707*F7","v":3040.7504610687188},{"$f":"SQRT(B40^2+D40^2)","v":3445.7573583717126},{"$f":"C40","v":972.08423872029562},"Group III","(DL + IL + 0.5 · WL)"]
[]
[]
[]
["Maximum Reactions:"]
[]
["All Load Groups:"]
[null,"Horizontal:",{"$f":"MAX(E16:E18,E27:E29,E38:E40)","v":5682.3820692368636},"lbs"]
[null,"Vertical:",{"$f":"VLOOKUP(C47,E16:I40,2,0)","v":582.62769950224788},"lbs"]
[null,"Load Case:",{"$f":"VLOOKUP(C47,E16:I40,3,0)","v":"Group II"}]
["Dead Load Only:",null,null,null,"Pole Coordinate Axis"]
[null,"Horizontal:",{"$f":"MAX(E16,E27,E38)","v":2589.9173476754477}]
[null,"Vertical:",{"$f":"VLOOKUP(C51,E16:I40,2,0)","v":582.62769950224788}]
[null,"Load Case:",{"$f":"VLOOKUP(C51,E16:I40,3,0)","v":"Group I"},null,"Note: SW4 and SW1 Reactions above use sign convention from SW4 and SW1 tabs"]

{"sheet":"P2","index":9,"n_rows":53,"n_cols":8,"rows_kept":53,"cut":false,"hidden":false,"merged":[[52,4,53,8],[24,1,24,3],[24,4,24,5],[24,6,25,8],[35,1,35,3],[35,4,35,5],[35,6,36,8],[49,4,49,6],[2,0,2,2],[2,3,2,5],[2,6,3,8],[13,1,13,3],[13,4,13,5],[13,6,14,8]]}
["P2 Reactions (Loads Due to SW1 & SW2)"]
[]
["SW1 - Support 2 (Right)",null,null,"SW2 - Support 1 (Left)",null,null,"Group Load"]
["Fx","Fy","Fz","Fx","Fy","Fz"]
[{"$f":"'SW1'!D401","v":1759.830636209399},{"$f":"'SW1'!E401","v":342.88792549775206},{"$f":"'SW1'!F401","v":0},{"$f":"'SW2'!A401","v":1956.9512485136743},{"$f":"'SW2'!B401","v":263.36551724137934},{"$f":"'SW2'!C401","v":0},"Group I","(DL)"]
[{"$f":"'SW1'!D402","v":3804.8368981276994},{"$f":"'SW1'!E402","v":342.88792549775206},{"$f":"'SW1'!F402","v":1454.4732827945704},{"$f":"'SW2'!A402","v":3039.2446466371084},{"$f":"'SW2'!B402","v":263.36551724137934},{"$f":"'SW2'!C402","v":1026.0473303981607},"Group II","(DL + WL)"]
[{"$f":"'SW1'!D403","v":2468.3083891027918},{"$f":"'SW1'!E403","v":569.20669877970454},{"$f":"'SW1'!F403","v":727.23664139728521},{"$f":"'SW2'!A403","v":2024.1422013904612},{"$f":"'SW2'!B403","v":444.04137931034484},{"$f":"'SW2'!C403","v":513.02366519908037},"Group III","(DL + IL + 0.5 · WL)"]
[]
["Case 1 Wind at 90˚ to SW1"]
["FX = 1.0 · FX SW1 + 0.0 · FZ SW2"]
["FY = 1.0 · FY SW1 + 1.0 · FY SW2"]
["Fz = 1.0 · FX SW2 + 1.0 · FZ SW1  + 0.2 FZ SW2"]
[]
[null,"Pole Reactions",null,null,"Resultants",null,"Group Load"]
[null,"Fx","Fy","Fz","Horizontal","Vertical"]
[null,{"$f":"A5+0*F5","v":1759.830636209399},{"$f":"B5+E5","v":606.2534427391314},{"$f":"1*D5+1*C5+0.2*F5","v":1956.9512485136743},{"$f":"SQRT(B16^2+D16^2)","v":2631.8552500470855},{"$f":"C16","v":606.2534427391314},"Group I","(DL)"]
[null,{"$f":"A6+0*F6","v":3804.8368981276994},{"$f":"B6+E6","v":606.2534427391314},{"$f":"1*D6+1*C6+0.2*F6","v":4698.9273955113113},{"$f":"SQRT(B17^2+D17^2)","v":6046.2138971128643},{"$f":"C17","v":606.2534427391314},"Group II","(DL + WL)"]
[null,{"$f":"A7+0*F7","v":2468.3083891027918},{"$f":"B7+E7","v":1013.2480780900494},{"$f":"1*D7+1*C7+0.2*F7","v":2853.9835758275622},{"$f":"SQRT(B18^2+D18^2)","v":3773.2967753423127},{"$f":"C18","v":1013.2480780900494},"Group III","(DL + IL + 0.5 · WL)"]
[]
["Case 2 Wind at 90˚ to SW2"]
["FX = 1.0 · FX SW1 + 1.0 · FZ SW2 + 0.2 · FZ SW1"]
["FY = 1.0 · FY SW1 + 1.0 · FY SW2"]
["Fz = 1.0 · FX SW2  + 0.0 · FZ SW1"]
[]
[null,"Pole Reactions",null,null,"Resultants",null,"Group Load"]
[null,"Fx","Fy","Fz","Horizontal","Vertical"]
[null,{"$f":"A5+1*F5+0.2*C5","v":1759.830636209399},{"$f":"B5+E5","v":606.2534427391314},{"$f":"D5+0*C5","v":1956.9512485136743},{"$f":"SQRT(B27^2+D27^2)","v":2631.8552500470855},{"$f":"C27","v":606.2534427391314},"Group I","(DL)"]
[null,{"$f":"A6+1*F6+0.2*C6","v":5121.7788850847737},{"$f":"B6+E6","v":606.2534427391314},{"$f":"D6+0*C6","v":3039.2446466371084},{"$f":"SQRT(B28^2+D28^2)","v":5955.6382504155299},{"$f":"C28","v":606.2534427391314},"Group II","(DL + WL)"]
[null,{"$f":"A7+1*F7+0.2*C7","v":3126.7793825813292},{"$f":"B7+E7","v":1013.2480780900494},{"$f":"D7+0*C7","v":2024.1422013904612},{"$f":"SQRT(B29^2+D29^2)","v":3724.7685778831283},{"$f":"C29","v":1013.2480780900494},"Group III","(DL + IL + 0.5 · WL)"]
[]
["Case 3 Wind at 45˚"]
["FX = 1.0 · FX SW1 + 0.707 · FZ SW2 + 0.2 · 0.707 · FZ SW1"]
["FY = 1.0 · FY SW1 + 1.0 · FY SW2"]
["Fz = 1.0 · FX SW2  +0.707 · FZ SW1 + 0.2 · 0.707 · FZ SW2"]
[]
[null,"Pole Reactions",null,null,"Resultants",null,"Group Load"]
[null,"Fx","Fy","Fz","Horizontal","Vertical"]
[null,{"$f":"A5+0.707*F5+0.2*0.707*C5","v":1759.830636209399},{"$f":"B5+E5","v":606.2534427391314},{"$f":"D5+0.707*C5+0.2*0.707*F5","v":1956.9512485136743},{"$f":"SQRT(B38^2+D38^2)","v":2631.8552500470855},{"$f":"C38","v":606.2534427391314},"Group I","(DL)"]
[null,{"$f":"A6+0.707*F6+0.2*0.707*C6","v":4735.9148829063506},{"$f":"B6+E6","v":606.2534427391314},{"$f":"D6+0.707*C6+0.2*0.707*F6","v":4212.6403500911692},{"$f":"SQRT(B39^2+D39^2)","v":6338.3932110078285},{"$f":"C39","v":606.2534427391314},"Group II","(DL + WL)"]
[null,{"$f":"A7+0.707*F7+0.2*0.707*C7","v":2933.8473814921181},{"$f":"B7+E7","v":1013.2480780900494},{"$f":"D7+0.707*C7+0.2*0.707*F7","v":2610.8400531174921},{"$f":"SQRT(B40^2+D40^2)","v":3927.3332225379991},{"$f":"C40","v":1013.2480780900494},"Group III","(DL + IL + 0.5 · WL)"]
[]
[]
[]
["Maximum Reactions:"]
[]
["All Load Groups:"]
[null,"Horizontal:",{"$f":"MAX(E16:E18,E27:E29,E38:E40)","v":6338.3932110078285},"lbs"]
[null,"Vertical:",{"$f":"VLOOKUP(C47,E16:I40,2,0)","v":606.2534427391314},"lbs"]
[null,"Load Case:",{"$f":"VLOOKUP(C47,E16:I40,3,0)","v":"Group II"}]
["Dead Load Only:",null,null,null,"Pole Coordinate Axis"]
[null,"Horizontal:",{"$f":"MAX(E16,E27,E38)","v":2631.8552500470855}]
[null,"Vertical:",{"$f":"VLOOKUP(C51,E16:I40,2,0)","v":606.2534427391314}]
[null,"Load Case:",{"$f":"VLOOKUP(C51,E16:I40,3,0)","v":"Group I"},null,"Note: SW1 and SW2 Reactions above use sign convention from SW1 and SW2 tabs"]

{"sheet":"P3","index":10,"n_rows":53,"n_cols":8,"rows_kept":53,"cut":false,"hidden":false,"merged":[[52,4,53,8],[24,1,24,3],[24,4,24,5],[24,6,25,8],[35,1,35,3],[35,4,35,5],[35,6,36,8],[49,4,49,6],[2,0,2,2],[2,3,2,5],[2,6,3,8],[13,1,13,3],[13,4,13,5],[13,6,14,8]]}
["P3 Reactions (Loads Due to SW2 & SW3)"]
[]
["SW2 - Support 2 (Right)",null,null,"SW3 - Support 1 (Left)",null,null,"Group Load"]
["Fx","Fy","Fz","Fx","Fy","Fz"]
[{"$f":"'SW2'!D401","v":1956.9512485136743},{"$f":"'SW2'!E401","v":369.13448275862066},{"$f":"'SW2'!F401","v":0},{"$f":"'SW3'!A401","v":1828.8107266435986},{"$f":"'SW3'!B401","v":259.69558823529411},{"$f":"'SW3'!C401","v":0},"Group I","(DL)"]
[{"$f":"'SW2'!D402","v":3039.2446466371084},{"$f":"'SW2'!E402","v":369.13448275862066},{"$f":"'SW2'!F402","v":1688.5295229351718},{"$f":"'SW3'!A402","v":4937.1393266081068},{"$f":"'SW3'!B402","v":259.69558823529411},{"$f":"'SW3'!C402","v":932.30087988705884},"Group II","(DL + WL)"]
[{"$f":"'SW2'!D403","v":2024.1422013904612},{"$f":"'SW2'!E403","v":625.06862068965518},{"$f":"'SW2'!F403","v":844.26476146758591},{"$f":"'SW3'!A403","v":3176.3446417717596},{"$f":"'SW3'!B403","v":433.39541176470584},{"$f":"'SW3'!C403","v":466.15043994352942},"Group III","(DL + IL + 0.5 · WL)"]
[]
["Case 1 Wind at 90˚ to SW2"]
["FX = 1.0 · FX SW2 + 0.0 · FZ SW3"]
["FY = 1.0 · FY SW2 + 1.0 · FY SW3"]
["Fz = 1.0 · FX SW3 + 1.0 · FZ SW2  + 0.2 FZ SW3"]
[]
[null,"Pole Reactions",null,null,"Resultants",null,"Group Load"]
[null,"Fx","Fy","Fz","Horizontal","Vertical"]
[null,{"$f":"A5+0*F5","v":1956.9512485136743},{"$f":"B5+E5","v":628.83007099391477},{"$f":"1*D5+1*C5+0.2*F5","v":1828.8107266435986},{"$f":"SQRT(B16^2+D16^2)","v":2678.4709934860066},{"$f":"C16","v":628.83007099391477},"Group I","(DL)"]
[null,{"$f":"A6+0*F6","v":3039.2446466371084},{"$f":"B6+E6","v":628.83007099391477},{"$f":"1*D6+1*C6+0.2*F6","v":6812.1290255206904},{"$f":"SQRT(B17^2+D17^2)","v":7459.36390602133},{"$f":"C17","v":628.83007099391477},"Group II","(DL + WL)"]
[null,{"$f":"A7+0*F7","v":2024.1422013904612},{"$f":"B7+E7","v":1058.4640324543611},{"$f":"1*D7+1*C7+0.2*F7","v":4113.8394912280519},{"$f":"SQRT(B18^2+D18^2)","v":4584.8475450157875},{"$f":"C18","v":1058.4640324543611},"Group III","(DL + IL + 0.5 · WL)"]
[]
["Case 2 Wind at 90˚ to SW3"]
["FX = 1.0 · FX SW2 + 1.0 · FZ SW3 + 0.2 · FZ SW2"]
["FY = 1.0 · FY SW2 + 1.0 · FY SW3"]
["Fz = 1.0 · FX SW3  + 0.0 · FZ SW2"]
[]
[null,"Pole Reactions",null,null,"Resultants",null,"Group Load"]
[null,"Fx","Fy","Fz","Horizontal","Vertical"]
[null,{"$f":"A5+1*F5+0.2*C5","v":1956.9512485136743},{"$f":"B5+E5","v":628.83007099391477},{"$f":"D5+0*C5","v":1828.8107266435986},{"$f":"SQRT(B27^2+D27^2)","v":2678.4709934860066},{"$f":"C27","v":628.83007099391477},"Group I","(DL)"]
[null,{"$f":"A6+1*F6+0.2*C6","v":4309.2514311112018},{"$f":"B6+E6","v":628.83007099391477},{"$f":"D6+0*C6","v":4937.1393266081068},{"$f":"SQRT(B28^2+D28^2)","v":6553.2429091919284},{"$f":"C28","v":628.83007099391477},"Group II","(DL + WL)"]
[null,{"$f":"A7+1*F7+0.2*C7","v":2659.1455936275079},{"$f":"B7+E7","v":1058.4640324543611},{"$f":"D7+0*C7","v":3176.3446417717596},{"$f":"SQRT(B29^2+D29^2)","v":4142.4896585774068},{"$f":"C29","v":1058.4640324543611},"Group III","(DL + IL + 0.5 · WL)"]
[]
["Case 3 Wind at 45˚"]
["FX = 1.0 · FX SW2 + 0.707 · FZ SW3 + 0.2 · 0.707 · FZ SW2"]
["FY = 1.0 · FY SW2 + 1.0 · FY SW3"]
["Fz = 1.0 · FX SW3  +0.707 · FZ SW2 + 0.2 · 0.707 · FZ SW3"]
[]
[null,"Pole Reactions",null,null,"Resultants",null,"Group Load"]
[null,"Fx","Fy","Fz","Horizontal","Vertical"]
[null,{"$f":"A5+0.707*F5+0.2*0.707*C5","v":1956.9512485136743},{"$f":"B5+E5","v":628.83007099391477},{"$f":"D5+0.707*C5+0.2*0.707*F5","v":1828.8107266435986},{"$f":"SQRT(B38^2+D38^2)","v":2678.4709934860066},{"$f":"C38","v":628.83007099391477},"Group I","(DL)"]
[null,{"$f":"A6+0.707*F6+0.2*0.707*C6","v":3937.139443260292},{"$f":"B6+E6","v":628.83007099391477},{"$f":"D6+0.707*C6+0.2*0.707*F6","v":6262.7570437393033},{"$f":"SQRT(B39^2+D39^2)","v":7397.5126079366855},{"$f":"C39","v":628.83007099391477},"Group II","(DL + WL)"]
[null,{"$f":"A7+0.707*F7+0.2*0.707*C7","v":2473.089599702053},{"$f":"B7+E7","v":1058.4640324543611},{"$f":"D7+0.707*C7+0.2*0.707*F7","v":3839.1535003373579},{"$f":"SQRT(B40^2+D40^2)","v":4566.7572485634755},{"$f":"C40","v":1058.4640324543611},"Group III","(DL + IL + 0.5 · WL)"]
[]
[]
[]
["Maximum Reactions:"]
[]
["All Load Groups:"]
[null,"Horizontal:",{"$f":"MAX(E16:E18,E27:E29,E38:E40)","v":7459.36390602133},"lbs"]
[null,"Vertical:",{"$f":"VLOOKUP(C47,E16:I40,2,0)","v":628.83007099391477},"lbs"]
[null,"Load Case:",{"$f":"VLOOKUP(C47,E16:I40,3,0)","v":"Group II"}]
["Dead Load Only:",null,null,null,"Pole Coordinate Axis"]
[null,"Horizontal:",{"$f":"MAX(E16,E27,E38)","v":2678.4709934860066}]
[null,"Vertical:",{"$f":"VLOOKUP(C51,E16:I40,2,0)","v":628.83007099391477}]
[null,"Load Case:",{"$f":"VLOOKUP(C51,E16:I40,3,0)","v":"Group I"},null,"Note: SW2 and SW3 Reactions above use sign convention from SW2 and SW3 tabs"]

{"sheet":"P4","index":11,"n_rows":53,"n_cols":8,"rows_kept":53,"cut":false,"hidden":false,"merged":[[52,4,53,8],[24,1,24,3],[24,4,24,5],[24,6,25,8],[35,1,35,3],[35,4,35,5],[35,6,36,8],[49,4,49,6],[2,0,2,2],[2,3,2,5],[2,6,3,8],[13,1,13,3],[13,4,13,5],[13,6,14,8]]}
["P4 Reactions (Loads Due to SW3 & SW4)"]
[]
["SW3 - Support 2 (Right)",null,null,"SW4 - Support 1 (Left)",null,null,"Group Load"]
["Fx","Fy","Fz","Fx","Fy","Fz"]
[{"$f":"'SW3'!D401","v":1828.8107266435986},{"$f":"'SW3'!E401","v":330.17941176470589},{"$f":"'SW3'!F401","v":0},{"$f":"'SW4'!A401","v":1900.17578125},{"$f":"'SW4'!B401","v":313.859375},{"$f":"'SW4'!C401","v":0},"Group I","(DL)"]
[{"$f":"'SW3'!D402","v":4937.1393266081068},{"$f":"'SW3'!E402","v":330.17941176470589},{"$f":"'SW3'!F402","v":1394.6325276862749},{"$f":"'SW4'!A402","v":1693.4006597319199},{"$f":"'SW4'!B402","v":313.859375},{"$f":"'SW4'!C402","v":1288.7278600693332},"Group II","(DL + WL)"]
[{"$f":"'SW3'!D403","v":3176.3446417717596},{"$f":"'SW3'!E403","v":548.5595882352942},{"$f":"'SW3'!F403","v":697.31626384313745},{"$f":"'SW4'!A403","v":1208.8702142936243},{"$f":"'SW4'!B403","v":531.97406249999995},{"$f":"'SW4'!C403","v":644.36393003466662},"Group III","(DL + IL + 0.5 · WL)"]
[]
["Case 1 Wind at 90˚ to SW3"]
["FX = 1.0 · FX SW3 + 0.0 · FZ SW4"]
["FY = 1.0 · FY SW3 + 1.0 · FY SW4"]
["Fz = 1.0 · FX SW4 + 1.0 · FZ SW3  + 0.2 FZ SW4"]
[]
[null,"Pole Reactions",null,null,"Resultants",null,"Group Load"]
[null,"Fx","Fy","Fz","Horizontal","Vertical"]
[null,{"$f":"A5+0*F5","v":1828.8107266435986},{"$f":"B5+E5","v":644.03878676470595},{"$f":"1*D5+1*C5+0.2*F5","v":1900.17578125},{"$f":"SQRT(B16^2+D16^2)","v":2637.2744782323539},{"$f":"C16","v":644.03878676470595},"Group I","(DL)"]
[null,{"$f":"A6+0*F6","v":4937.1393266081068},{"$f":"B6+E6","v":644.03878676470595},{"$f":"1*D6+1*C6+0.2*F6","v":3345.7787594320616},{"$f":"SQRT(B17^2+D17^2)","v":5964.0238293795483},{"$f":"C17","v":644.03878676470595},"Group II","(DL + WL)"]
[null,{"$f":"A7+0*F7","v":3176.3446417717596},{"$f":"B7+E7","v":1080.533650735294},{"$f":"1*D7+1*C7+0.2*F7","v":2035.0592641436951},{"$f":"SQRT(B18^2+D18^2)","v":3772.3509237462581},{"$f":"C18","v":1080.533650735294},"Group III","(DL + IL + 0.5 · WL)"]
[]
["Case 2 Wind at 90˚ to SW4"]
["FX = 1.0 · FX SW3 + 1.0 · FZ SW4 + 0.2 · FZ SW3"]
["FY = 1.0 · FY SW3 + 1.0 · FY SW4"]
["Fz = 1.0 · FX SW4  + 0.0 · FZ SW3"]
[]
[null,"Pole Reactions",null,null,"Resultants",null,"Group Load"]
[null,"Fx","Fy","Fz","Horizontal","Vertical"]
[null,{"$f":"A5+1*F5+0.2*C5","v":1828.8107266435986},{"$f":"B5+E5","v":644.03878676470595},{"$f":"D5+0*C5","v":1900.17578125},{"$f":"SQRT(B27^2+D27^2)","v":2637.2744782323539},{"$f":"C27","v":644.03878676470595},"Group I","(DL)"]
[null,{"$f":"A6+1*F6+0.2*C6","v":6504.7936922146955},{"$f":"B6+E6","v":644.03878676470595},{"$f":"D6+0*C6","v":1693.4006597319199},{"$f":"SQRT(B28^2+D28^2)","v":6721.6029913002594},{"$f":"C28","v":644.03878676470595},"Group II","(DL + WL)"]
[null,{"$f":"A7+1*F7+0.2*C7","v":3960.171824575054},{"$f":"B7+E7","v":1080.533650735294},{"$f":"D7+0*C7","v":1208.8702142936243},{"$f":"SQRT(B29^2+D29^2)","v":4140.5709841958305},{"$f":"C29","v":1080.533650735294},"Group III","(DL + IL + 0.5 · WL)"]
[]
["Case 3 Wind at 45˚"]
["FX = 1.0 · FX SW3 + 0.707 · FZ SW4 + 0.2 · 0.707 · FZ SW3"]
["FY = 1.0 · FY SW3 + 1.0 · FY SW4"]
["Fz = 1.0 · FX SW4  +0.707 · FZ SW3 + 0.2 · 0.707 · FZ SW4"]
[]
[null,"Pole Reactions",null,null,"Resultants",null,"Group Load"]
[null,"Fx","Fy","Fz","Horizontal","Vertical"]
[null,{"$f":"A5+0.707*F5+0.2*0.707*C5","v":1828.8107266435986},{"$f":"B5+E5","v":644.03878676470595},{"$f":"D5+0.707*C5+0.2*0.707*F5","v":1900.17578125},{"$f":"SQRT(B38^2+D38^2)","v":2637.2744782323539},{"$f":"C38","v":644.03878676470595},"Group I","(DL)"]
[null,{"$f":"A6+0.707*F6+0.2*0.707*C6","v":6045.4709630919642},{"$f":"B6+E6","v":644.03878676470595},{"$f":"D6+0.707*C6+0.2*0.707*F6","v":2861.63197621992},{"$f":"SQRT(B39^2+D39^2)","v":6688.5466831676076},{"$f":"C39","v":644.03878676470595},"Group II","(DL + WL)"]
[null,{"$f":"A7+0.707*F7+0.2*0.707*C7","v":3730.5104600136883},{"$f":"B7+E7","v":1080.533650735294},{"$f":"D7+0.707*C7+0.2*0.707*F7","v":1792.9858725376243},{"$f":"SQRT(B40^2+D40^2)","v":4139.0224246059652},{"$f":"C40","v":1080.533650735294},"Group III","(DL + IL + 0.5 · WL)"]
[]
[]
[]
["Maximum Reactions:"]
[]
["All Load Groups:"]
[null,"Horizontal:",{"$f":"MAX(E16:E18,E27:E29,E38:E40)","v":6721.6029913002594},"lbs"]
[null,"Vertical:",{"$f":"VLOOKUP(C47,E16:I40,2,0)","v":644.03878676470595},"lbs"]
[null,"Load Case:",{"$f":"VLOOKUP(C47,E16:I40,3,0)","v":"Group II"}]
["Dead Load Only:",null,null,null,"Pole Coordinate Axis"]
[null,"Horizontal:",{"$f":"MAX(E16,E27,E38)","v":2637.2744782323539}]
[null,"Vertical:",{"$f":"VLOOKUP(C51,E16:I40,2,0)","v":644.03878676470595}]
[null,"Load Case:",{"$f":"VLOOKUP(C51,E16:I40,3,0)","v":"Group I"},null,"Note: SW3 and SW4 Reactions above use sign convention from SW3 and SW4 tabs"]

{"sheet":"SUMMARY","index":12,"n_rows":221,"n_cols":9,"rows_kept":221,"cut":false,"hidden":false,"merged":[[24,3,25,3],[18,3,19,3],[28,1,28,2],[28,3,28,5],[22,1,23,1],[22,3,23,3],[24,1,25,1],[0,0,0,8],[18,1,19,1],[20,1,21,1],[20,3,21,3],[16,4,16,6],[16,1,17,1],[16,2,17,2],[16,3,17,3]]}
["Summary of Results"]
[]
[]
["Span Wire Tension:"]
[]
["Span Wire","Controlling Tension                (lbs)","Controlling Load Group","Allowable Overstress (%)","Wire Diameter","Wire Material","Allowable Tension w/o Overstress (lbs)","Allowable Tension  w/ Overstress          (lbs)","Check"]
["SW1",{"$f":"IF(Input!I49=\"YES\",MAX('SW1'!A407:B409),\"N/A\")","v":4087.7681540382619},{"$f":"IF(Input!I49=\"YES\",IF(OR(B7='SW1'!$A$407,B7='SW1'!$A$408,B7='SW1'!$A$409),VLOOKUP(B7,'SW1'!$A$407:$E$409,3,0),VLOOKUP(B7,'SW1'!$B$407:$E$409,2,0)),\"N/A\")","v":"Group II"},{"$f":"IF(Input!I49=\"YES\",VLOOKUP(C7,'Pick Lists & Data'!$A$51:$B$53,2,0),\"N/A\")","v":1.33},{"$f":"IF(Input!I49=\"YES\",SW1_Wire_Dia,\"N/A\")","v":"0.5\""},{"$f":"IF(Input!I49=\"YES\",SW1_Wire_Material,\"N/A\")","v":"ASTM A 475"},{"$f":"IF(Input!I49=\"YES\",IF(F7='Pick Lists & Data'!$A$46,VLOOKUP(E7,'Pick Lists & Data'!$A$29:$F$33,5,0),VLOOKUP(E7,'Pick Lists & Data'!$A$29:$F$33,6,0)),\"N/A\")","v":5707},{"$f":"IF(Input!I49=\"YES\",G7*D7,\"N/A\")","v":7590.31},{"$f":"IF(Input!I49=\"YES\",IF(B7<=H7,\"OK\",\"NO GOOD\"),\"N/A\")","v":"OK"}]
["SW2",{"$f":"IF(Input!I50=\"YES\",MAX('SW2'!A407:B409),\"N/A\")","v":3496.3409785513591},{"$f":"IF(Input!I50=\"YES\",IF(OR(B8='SW2'!$A$407,B8='SW2'!$A$408,B8='SW2'!$A$409),VLOOKUP(B8,'SW2'!$A$407:$E$409,3,0),VLOOKUP(B8,'SW2'!$B$407:$E$409,2,0)),\"N/A\")","v":"Group II"},{"$f":"IF(Input!I50=\"YES\",VLOOKUP(C8,'Pick Lists & Data'!$A$51:$B$53,2,0),\"N/A\")","v":1.33},{"$f":"IF(Input!I50=\"YES\",SW2_Wire_Dia,\"N/A\")","v":"0.5\""},{"$f":"IF(Input!I50=\"YES\",SW2_Wire_Material,\"N/A\")","v":"ASTM A 475"},{"$f":"IF(Input!I50=\"YES\",IF(F8='Pick Lists & Data'!$A$46,VLOOKUP(E8,'Pick Lists & Data'!$A$29:$F$33,5,0),VLOOKUP(E8,'Pick Lists & Data'!$A$29:$F$33,6,0)),\"N/A\")","v":5707},{"$f":"IF(Input!I50=\"YES\",G8*D8,\"N/A\")","v":7590.31},{"$f":"IF(Input!I50=\"YES\",IF(B8<=H8,\"OK\",\"NO GOOD\"),\"N/A\")","v":"OK"}]
["SW3",{"$f":"IF(Input!I51=\"YES\",MAX('SW3'!A407:B409),\"N/A\")","v":5140.9496264381205},{"$f":"IF(Input!I51=\"YES\",IF(OR(B9='SW3'!$A$407,B9='SW3'!$A$408,B9='SW3'!$A$409),VLOOKUP(B9,'SW3'!$A$407:$E$409,3,0),VLOOKUP(B9,'SW3'!$B$407:$E$409,2,0)),\"N/A\")","v":"Group II"},{"$f":"IF(Input!I51=\"YES\",VLOOKUP(C9,'Pick Lists & Data'!$A$51:$B$53,2,0),\"N/A\")","v":1.33},{"$f":"IF(Input!I51=\"YES\",SW3_Wire_Dia,\"N/A\")","v":"0.5\""},{"$f":"IF(Input!I51=\"YES\",SW3_Wire_Material,\"N/A\")","v":"ASTM A 475"},{"$f":"IF(Input!I51=\"YES\",IF(F9='Pick Lists & Data'!$A$46,VLOOKUP(E9,'Pick Lists & Data'!$A$29:$F$33,5,0),VLOOKUP(E9,'Pick Lists & Data'!$A$29:$F$33,6,0)),\"N/A\")","v":5707},{"$f":"IF(Input!I51=\"YES\",G9*D9,\"N/A\")","v":7590.31},{"$f":"IF(Input!I51=\"YES\",IF(B9<=H9,\"OK\",\"NO GOOD\"),\"N/A\")","v":"OK"}]
["SW4",{"$f":"IF(Input!I52=\"YES\",MAX('SW4'!A407:B409),\"N/A\")","v":2250.2447015876501},{"$f":"IF(Input!I52=\"YES\",IF(OR(B10='SW4'!$A$407,B10='SW4'!$A$408,B10='SW4'!$A$409),VLOOKUP(B10,'SW4'!$A$407:$E$409,3,0),VLOOKUP(B10,'SW4'!$B$407:$E$409,2,0)),\"N/A\")","v":"Group II"},{"$f":"IF(Input!I52=\"YES\",VLOOKUP(C10,'Pick Lists & Data'!$A$51:$B$53,2,0),\"N/A\")","v":1.33},{"$f":"IF(Input!I52=\"YES\",SW4_Wire_Dia,\"N/A\")","v":"0.5\""},{"$f":"IF(Input!I52=\"YES\",SW4_Wire_Material,\"N/A\")","v":"ASTM A 475"},{"$f":"IF(Input!I52=\"YES\",IF(F10='Pick Lists & Data'!$A$46,VLOOKUP(E10,'Pick Lists & Data'!$A$29:$F$33,5,0),VLOOKUP(E10,'Pick Lists & Data'!$A$29:$F$33,6,0)),\"N/A\")","v":5707},{"$f":"IF(Input!I52=\"YES\",G10*D10,\"N/A\")","v":7590.31},{"$f":"IF(Input!I52=\"YES\",IF(B10<=H10,\"OK\",\"NO GOOD\"),\"N/A\")","v":"OK"}]
["N/A indicates that spanwire is not present."]
[]
["Pole Reactions:"]
[]
[]
[]
[null,"Pole","Connecting Span Wires","Angle Between Wires","Reactions"]
[null,null,null,null,"Load Group","Horizontal (lbs)","Vertical (lbs)"]
[null,"P1",{"$f":"IF(Input!I52=\"YES\",\"SW4\",\"N/A\")","v":"SW4"},{"$f":"IF(AND(Input!I49=\"YES\",Input!I52=\"YES\"),Input!F49,\"N/A\")","v":38},{"$f":"IF(AND(Input!I49=\"NO\",Input!I52=\"NO\"),\"N/A\",\"Group I (DL Only)\")","v":"Group I (DL Only)"},{"$f":"IF(AND(Input!I49=\"NO\",Input!I52=\"NO\"),\"N/A\",'P1'!C51)","v":2589.9173476754477},{"$f":"IF(AND(Input!I49=\"NO\",Input!I52=\"NO\"),\"N/A\",'P1'!C52)","v":582.62769950224788}]
[null,null,{"$f":"IF(Input!I49=\"YES\",\"SW1\",\"N/A\")","v":"SW1"},null,{"$f":"IF(AND(Input!I49=\"NO\",Input!I52=\"NO\"),\"N/A\",'P1'!C49)","v":"Group II"},{"$f":"IF(AND(Input!I49=\"NO\",Input!I52=\"NO\"),\"N/A\",'P1'!C47)","v":5682.3820692368636},{"$f":"IF(AND(Input!I49=\"NO\",Input!I52=\"NO\"),\"N/A\",'P1'!C48)","v":582.62769950224788}]
[null,"P2",{"$f":"IF(Input!I49=\"YES\",\"SW1\",\"N/A\")","v":"SW1"},{"$f":"IF(AND(Input!I49=\"YES\",Input!I50=\"YES\"),Input!F50,\"N/A\")","v":146},{"$f":"IF(AND(Input!I49=\"NO\",Input!I50=\"NO\"),\"N/A\",\"Group I (DL Only)\")","v":"Group I (DL Only)"},{"$f":"IF(AND(Input!I49=\"NO\",Input!I50=\"NO\"),\"N/A\",'P2'!C51)","v":2631.8552500470855},{"$f":"IF(AND(Input!I49=\"NO\",Input!I50=\"NO\"),\"N/A\",'P2'!C52)","v":606.2534427391314}]
[null,null,{"$f":"IF(Input!I50=\"YES\",\"SW2\",\"N/A\")","v":"SW2"},null,{"$f":"IF(AND(Input!I49=\"NO\",Input!I50=\"NO\"),\"N/A\",'P2'!C49)","v":"Group II"},{"$f":"IF(AND(Input!I49=\"NO\",Input!I50=\"NO\"),\"N/A\",'P2'!C47)","v":6338.3932110078285},{"$f":"IF(AND(Input!I49=\"NO\",Input!I50=\"NO\"),\"N/A\",'P2'!C48)","v":606.2534427391314}]
[null,"P3",{"$f":"IF(Input!I50=\"YES\",\"SW2\",\"N/A\")","v":"SW2"},{"$f":"IF(AND(Input!I50=\"YES\",Input!I51=\"YES\"),Input!F51,\"N/A\")","v":39},{"$f":"IF(AND(Input!I50=\"NO\",Input!I51=\"NO\"),\"N/A\",\"Group I (DL Only)\")","v":"Group I (DL Only)"},{"$f":"IF(AND(Input!I50=\"NO\",Input!I51=\"NO\"),\"N/A\",'P3'!C51)","v":2678.4709934860066},{"$f":"IF(AND(Input!I50=\"NO\",Input!I51=\"NO\"),\"N/A\",'P3'!C52)","v":628.83007099391477}]
[null,null,{"$f":"IF(Input!I51=\"YES\",\"SW3\",\"N/A\")","v":"SW3"},null,{"$f":"IF(AND(Input!I50=\"NO\",Input!I51=\"NO\"),\"N/A\",'P3'!C49)","v":"Group II"},{"$f":"IF(AND(Input!I50=\"NO\",Input!I51=\"NO\"),\"N/A\",'P3'!C47)","v":7459.36390602133},{"$f":"IF(AND(Input!I50=\"NO\",Input!I51=\"NO\"),\"N/A\",'P3'!C48)","v":628.83007099391477}]
[null,"P4",{"$f":"IF(Input!I51=\"YES\",\"SW3\",\"N/A\")","v":"SW3"},{"$f":"IF(AND(Input!I51=\"YES\",Input!I52=\"YES\"),Input!F52,\"N/A\")","v":137},{"$f":"IF(AND(Input!I51=\"NO\",Input!I52=\"NO\"),\"N/A\",\"Group I (DL Only)\")","v":"Group I (DL Only)"},{"$f":"IF(AND(Input!I51=\"NO\",Input!I52=\"NO\"),\"N/A\",'P4'!C51)","v":2637.2744782323539},{"$f":"IF(AND(Input!I51=\"NO\",Input!I52=\"NO\"),\"N/A\",'P4'!C52)","v":644.03878676470595}]
[null,null,{"$f":"IF(Input!I52=\"YES\",\"SW4\",\"N/A\")","v":"SW4"},null,{"$f":"IF(AND(Input!I51=\"NO\",Input!I52=\"NO\"),\"N/A\",'P4'!C49)","v":"Group II"},{"$f":"IF(AND(Input!I51=\"NO\",Input!I52=\"NO\"),\"N/A\",'P4'!C47)","v":6721.6029913002594},{"$f":"IF(AND(Input!I51=\"NO\",Input!I52=\"NO\"),\"N/A\",'P4'!C48)","v":644.03878676470595}]
[null,"N/A indicates that the spanwire or pole is not present."]
[]
[]
[]
[]
[]
[]
[]
[]
[]
[]
[]
[]
[]
[]
[]
[]
[]
[]
[]
[]
[]
[]
[]
[]
[]
[]
[]
[]
[]
[]
[]
[]
[]
[]
[]
[]
[]
[]
[]
[]
[]
[]
[]
[]
[]
[]
[]
[]
[]
[]
[]
[]
[]
[]
[]
[]
[]
[]
[]
[]
[]
[]
[]
[]
[]
[]
[]
[]
[]
[]
[]
[]
[]
[]
[]
[]
[]
[]
[]
[]
[]
[]
[]
[]
[]
[]
[]
[]
[]
[]
[]
[]
[]
[]
[]
[]
[]
[]
[]
[]
[]
[]
[]
[]
[]
[]
[]
[]
[]
[]
[]
[]
[]
[]
[]
[]
[]
[]
[]
[]
[]
[]
[]
[]
[]
[]
[]
[]
[]
[]
[]
[]
[]
[]
[]
[]
[]
[]
[]
[]
[]
[]
[]
[]
[]
[]
[]
[]
[]
[]
[]
[]
[]
[]
[]
[]
[]
[]
[]
[]
[]
[]
[]
[]
[]
[]
[]
[]
[]
[]
[]
[]
[]
[]
[]
[null,null,5200]
[]
[]
[]
[]
[]
[]
[]
[]
[]
[]
[]
[]
[]
[]
[]
[]
[null,null,null,null,null,null,null,{"$f":"SUM(H206:H219)","v":0}]
[null,null,null,null,{"$f":"E151","v":0}]

{"sheet":"Member Local Coordinates","index":13,"n_rows":3,"n_cols":3,"rows_kept":3,"cut":false,"hidden":false,"merged":[[2,2,2,6]]}
[]
[]
[null,null,"Member Local Coordinates"]

{"sheet":"Pick Lists & Data","index":14,"n_rows":58,"n_cols":12,"rows_kept":58,"cut":false,"hidden":false,"merged":[[49,0,49,1],[36,3,37,3],[36,4,37,4],[36,2,37,2],[36,1,37,1],[36,0,37,0],[36,6,37,6],[9,8,9,11],[10,8,12,11],[26,2,26,3],[26,4,26,5],[36,5,37,5]]}
["Wind Load Data:"]
[null,"Wind Velocity, Vfm, =",80,"mph",null,null,null,null,null,"(Pub. 149,  20.1, Section 15.2P)"]
[null,"Coefficient of Height, Ch =",1,null,null,null,null,null,null,"(A Tbl C-1, Assumes all components are between 14 and 29 feet above the ground)"]
[null,"Wind Pressure, Pz ="," 0.00256 · (1.3 · Vfm)2 · Cd · Ch",null,null,null,null,null,null,"AASHTO Appendix C.3"]
[null,"Wind Load, WL = ","Pz · Surface Area "]
[]
["Ice Load Data:"]
[null,"Ice Load =",3,"lbs/ft2",null,null,null,null,null,"AASHTO Article 3.7"]
[null,null,null,null,null,null,null,null,"Notes:"]
["Signal Configuration - Signal Sections Each Direction","Load With Back Plate (lbs)","Wind Area w/ 5\" Backplate Border (ft2)","Wind Drag Coefficient, Cd (A Tbl C-2)","Wind Pressure, Pz (psf)","Wind Load, WL (lbs)","Ice Area = 2 · Wind Area +2 ft2","Ice Load (lbs)","-For Ice Area, ice covers all sides of signal so assmue 2 · Wind Area for front and rear face and 2 ft2 for other sides of signal."]
["None",0,0,1.2,{"$f":"0.00256*(1.3*Vfm)^2*Ch*D11","v":33.226751999999998},{"$f":"E11*C11","v":0},0,{"$f":"G11*Ice","v":0},"-Dead Load and Wind Area taken in accordance with PennDOT Pub 149, Table 20-2"]
["A-3",70,8.76,1.2,{"$f":"0.00256*(1.3*Vfm)^2*Ch*D12","v":33.226751999999998},{"$f":"E12*C12","v":291.06634751999997},{"$f":"2*C12+2","v":19.52},58.56]
["A-4",89,11.04,1.2,33.226751999999998,366.82334207999992,{"$f":"2*C13+2","v":24.08},72.239999999999995]
["A-5",97,13.89,1.2,33.226751999999998,461.51958528,29.78,89.34]
["B-3",129,8.76,1.2,33.226751999999998,291.06634751999997,19.52,58.56]
["C-3",131,13.41,1.2,33.226751999999998,445.57074431999996,28.82,86.460000000000008]
["B-4",165,11.04,1.2,33.226751999999998,366.82334207999992,24.08,72.239999999999995]
["C-4",167,17.239999999999998,1.2,33.226751999999998,572.82920447999993,36.479999999999997,109.44]
["B-5",189,13.89,1.2,33.226751999999998,461.51958528,29.78,89.34]
["D-3",190,13.41,1.2,33.226751999999998,445.57074431999996,28.82,86.460000000000008]
["E-3",190,18.059999999999999,1.2,33.226751999999998,600.0751411199999,38.119999999999997,114.35999999999999]
["D-4",242,17.239999999999998,1.2,33.226751999999998,572.82920447999993,36.479999999999997,109.44]
["E-4",242,23.44,1.2,33.226751999999998,778.83506688,48.88,146.64000000000001]
["F-3",249,18.059999999999999,1.2,33.226751999999998,600.0751411199999,38.119999999999997,114.35999999999999]
["F-4",318,23.44,1.2,33.226751999999998,778.83506688,48.88,146.64000000000001]
[]
[null,null,"Minimum Breaking Strength*",null,"Allowable Force**"]
["Wire Diameter (in)","Wire Weight (lb/ft)","ASTM A 475, Class A, Siemens-Martin Grade","ASTM B 416","ASTM A 475","ASTM B 416","Wire Diameter (in)","Wind Drag Coefficient, Cd (A Tbl C-2)","Wind Pressure, Pz (psf)","Wind Load (lb/ft)","Ice Area (ft2/ft)","Ice Load (lb/ft)"]
["0.25\"",1,3150,6301,{"$f":"ROUNDDOWN(C29/2.12,0)","v":1485},2972,0.25,1.1000000000000001,{"$f":"0.00256*(1.3*Vfm)^2*Ch*H29","v":30.457856000000003},{"$f":"I29*G29/12","v":0.6345386666666667},{"$f":"PI()*(G29/12)","v":6.5449846949787352E-2},{"$f":"ROUNDUP(Ice*K29,2)","v":0.2}]
["0.3125\"",1,5350,10020,2523,4726,0.3125,1.1000000000000001,{"$f":"0.00256*(1.3*Vfm)^2*Ch*H30","v":30.457856000000003},{"$f":"I30*G30/12","v":0.7931733333333334},{"$f":"PI()*(G30/12)","v":8.18123086872342E-2},{"$f":"ROUNDUP(Ice*K30,2)","v":0.25}]
["0.375\"",1,6950,15930,3278,7514,0.375,1.1000000000000001,{"$f":"0.00256*(1.3*Vfm)^2*Ch*H31","v":30.457856000000003},{"$f":"I31*G31/12","v":0.9518080000000001},{"$f":"PI()*(G31/12)","v":9.8174770424681035E-2},{"$f":"ROUNDUP(Ice*K31,2)","v":0.3}]
["0.4375\"",1,9350,19060,4410,8990,0.4375,1.1000000000000001,{"$f":"0.00256*(1.3*Vfm)^2*Ch*H32","v":30.457856000000003},{"$f":"I32*G32/12","v":1.1104426666666669},{"$f":"PI()*(G32/12)","v":0.11453723216212788},{"$f":"ROUNDUP(Ice*K32,2)","v":0.35000000000000003}]
["0.5\"",1,12100,23000,5707,10849,0.5,1.1000000000000001,{"$f":"0.00256*(1.3*Vfm)^2*Ch*H33","v":30.457856000000003},{"$f":"I33*G33/12","v":1.2690773333333334},{"$f":"PI()*(G33/12)","v":0.1308996938995747},{"$f":"ROUNDUP(Ice*K33,2)","v":0.4}]
["*TC-8801, Sheet 2 of 7"]
["**Minimum Breaking Strength ÷ 2.12 ( 2.12 is the typical FS from AASHTO Standard Specifications for ASD Design)"]
[]
["Sign Sizes (LxW)","Load (lbs)","Surface Area (ft2)","Wind Drag Coefficient, Cd (A Tbl C-2)","Wind Pressure, Pz (psf)","Wind Load, WL (lbs)","Ice Load (lbs)"]
[]
["None",0,0,0,{"$f":"0.00256*(1.3*Vfm)^2*Ch*D39","v":0},{"$f":"E39*C39","v":0},{"$f":"C39*Ice","v":0}]
["30\" x 36\"",39,7.5,1.19,{"$f":"0.00256*(1.3*Vfm)^2*Ch*D40","v":32.949862400000001},{"$f":"E40*C40","v":247.12396799999999},{"$f":"C40*Ice","v":22.5}]
["None",0,0,0,{"$f":"0.00256*(1.3*Vfm)^2*Ch*D41","v":0},{"$f":"E41*C41","v":0},{"$f":"C41*Ice","v":0}]
["72\" x 21\"",87,10.5,1.2,{"$f":"0.00256*(1.3*Vfm)^2*Ch*D42","v":33.226751999999998},{"$f":"E42*C42","v":348.88089599999995},{"$f":"C42*Ice","v":31.5}]
["96\" x 32\"",106,21.33,1.2,{"$f":"0.00256*(1.3*Vfm)^2*Ch*D43","v":33.226751999999998},{"$f":"E43*C43","v":708.72662015999992},{"$f":"C43*Ice","v":63.989999999999995}]
[]
["Wire Material"]
["ASTM A 475"]
["ASTM B 416"]
[]
[]
["Allowable Overstress"]
["Group I",1]
["Group II",1.33]
["Group III",1.33]
["(AASHTO Sign Spec, Tbl 3-1)"]
[]
["Spanwire Present:"]
["YES"]
["NO"]